Cyclopentane, 1,2-dimethyl-, trans-
- Formula: C7H14
- Molecular weight: 98.1861
- IUPAC Standard InChIKey: RIRARCHMRDHZAR-BQBZGAKWSA-N
- CAS Registry Number: 822-50-4
- Chemical structure:
View 3d structure (requires JavaScript / HTML 5) - Stereoisomers:
- Other names: trans-1,2-Dimethylcyclopentane; 1,trans-2-Dimethylcyclopentane; 1,2-Dimethylcyclopentane, trans; t-1,2-Dimethylcyclopentane; (E)-1,2-Dimethylcyclopentane; Cyclopentane, 1,2-dimethyl-

Gas phase thermochemistry data

Data compiled as indicated in comments:
ALS - Hussein Y. Afeefy, Joel F. Liebman, and Stephen E. Stein
GT - Glushko Thermocenter, Russian Academy of Sciences, Moscow
Quantity | Value | Units | Method | Reference | Comment |
---|---|---|---|---|---|
ΔfH°gas | -136.7 ± 1.3 | kJ/mol | Cm | Johnson, Prosen, et al., 1949 | ALS |
Constant pressure heat capacity of gas
Cp,gas (J/mol*K) | Temperature (K) | Reference | Comment |
---|---|---|---|
44.51 | 50. | Thermodynamics Research Center, 1997 | p=1 bar. Recommended values are in close agreement with those calculated by a method of increments [ Epstein M.B., 1949] at low temperatures. Discrepancies increase up to 2-4 J/mol*K at T=1500 K.; GT |
61.44 | 100. | ||
76.91 | 150. | ||
93.09 | 200. | ||
122.9 | 273.15 | ||
134.5 | 298.15 | ||
135.4 | 300. | ||
182.7 | 400. | ||
225.4 | 500. | ||
261.1 | 600. | ||
290.9 | 700. | ||
316.0 | 800. | ||
337.4 | 900. | ||
355.6 | 1000. | ||
371.3 | 1100. | ||
384.8 | 1200. | ||
396.5 | 1300. | ||
406.5 | 1400. | ||
415.3 | 1500. | ||
432.5 | 1750. | ||
445.0 | 2000. | ||
454.2 | 2250. | ||
461.1 | 2500. | ||
466.5 | 2750. | ||
470.7 | 3000. |

Condensed phase thermochemistry data

Data compiled by: Hussein Y. Afeefy, Joel F. Liebman, and Stephen E. Stein
Quantity | Value | Units | Method | Reference | Comment |
---|---|---|---|---|---|
ΔfH°liquid | -171.3 ± 1.2 | kJ/mol | Cm | Johnson, Prosen, et al., 1949 | |
Quantity | Value | Units | Method | Reference | Comment |
ΔcH°liquid | -4584.2 ± 1.1 | kJ/mol | Cm | Johnson, Prosen, et al., 1949 | Corresponding ΔfHºliquid = -171.2 kJ/mol (simple calculation by NIST; no Washburn corrections) |

Phase change data

Data compiled as indicated in comments:
BS - Robert L. Brown and Stephen E. Stein
TRC - Thermodynamics Research Center, NIST Boulder Laboratories, Chris Muzny director
AC - William E. Acree, Jr., James S. Chickos
DRB - Donald R. Burgess, Jr.
Quantity | Value | Units | Method | Reference | Comment |
---|---|---|---|---|---|
Tboil | 365.0 ± 0.1 | K | AVG | N/A | Average of 14 out of 15 values; Individual data points |
Quantity | Value | Units | Method | Reference | Comment |
Tfus | 155. ± 2. | K | AVG | N/A | Average of 7 values; Individual data points |
Quantity | Value | Units | Method | Reference | Comment |
Ttriple | 154.1 | K | N/A | Huffman, Parks, et al., 1931 | Uncertainty assigned by TRC = 0.2 K; TRC |
Ttriple | 154.2 | K | N/A | Parks and Huffman, 1931 | Uncertainty assigned by TRC = 0.1 K; TRC |
Quantity | Value | Units | Method | Reference | Comment |
ΔvapH° | 34.6 | kJ/mol | N/A | Reid, 1972 | AC |
ΔvapH° | 34.6 | kJ/mol | N/A | Johnson, Prosen, et al., 1949 | DRB |
Enthalpy of vaporization
ΔvapH (kJ/mol) | Temperature (K) | Method | Reference | Comment |
---|---|---|---|---|
34.2 | 310. | A | Stephenson and Malanowski, 1987 | Based on data from 295. to 367. K.; AC |
34.0 | 314. | N/A | Forziati, Norris, et al., 1949 | Based on data from 299. to 366. K.; AC |
Antoine Equation Parameters
log10(P) = A − (B / (T + C))
P = vapor pressure (bar)
T = temperature (K)
View plot Requires a JavaScript / HTML 5 canvas capable browser.
Temperature (K) | A | B | C | Reference | Comment |
---|---|---|---|---|---|
299.26 to 365.92 | 3.96059 | 1237.866 | -52.023 | Forziati, Norris, et al., 1949, 2 | Coefficents calculated by NIST from author's data. |

Reaction thermochemistry data

Data compiled by: Hussein Y. Afeefy, Joel F. Liebman, and Stephen E. Stein
Individual Reactions
By formula: 2H2 + 2C7H12 = C7H14 + C7H14
Quantity | Value | Units | Method | Reference | Comment |
---|---|---|---|---|---|
ΔrH° | -94.35 ± 0.75 | kJ/mol | Chyd | Allinger, Dodziuk, et al., 1982 | liquid phase; solvent: Hexane |
By formula: 2H2 + C7H10 = C7H14
Quantity | Value | Units | Method | Reference | Comment |
---|---|---|---|---|---|
ΔrH° | -231. ± 0.8 | kJ/mol | Chyd | Roth, Adamczak, et al., 1991 | liquid phase |

Gas phase ion energetics data

Data compiled as indicated in comments:
LL - Sharon G. Lias and Joel F. Liebman
LLK - Sharon G. Lias, Rhoda D. Levin, and Sherif A. Kafafi
Ionization energy determinations
IE (eV) | Method | Reference | Comment |
---|---|---|---|
9.48 ± 0.05 | EI | Holmes and Lossing, 1991 | LL |
9.95 ± 0.05 | EI | Herzschuh and Sicker, 1981 | LLK |
Appearance energy determinations
Ion | AE (eV) | Other Products | Method | Reference | Comment |
---|---|---|---|---|---|
C5H9+ | 10.80 ± 0.05 | C2H5 | EI | Herzschuh and Sicker, 1981 | LLK |
C6H11+ | 10.70 ± 0.05 | CH3 | EI | Herzschuh and Sicker, 1981 | LLK |

Kovats' RI, non-polar column, isothermal

Column type | Active phase | Temperature (C) | I | Reference | Comment |
---|---|---|---|---|---|
Capillary | OV-101 | 40. | 685.6 | Chen, Liang, et al., 2001 | He; Column length: 50. m; Column diameter: 0.25 mm |
Capillary | OV-101 | 60. | 689.1 | Chen, Liang, et al., 2001 | He; Column length: 50. m; Column diameter: 0.25 mm |
Capillary | CP Sil 2 | 60. | 694.1 | Estel, Mohnke, et al., 1995 | 100. m/0.25 mm/0.25 μm |
Capillary | Squalane | 25. | 685. | Hilal, Carreira, et al., 1994 | |
Capillary | DB-1 | 60. | 690.0 | Krupcik, Skacani, et al., 1994 | H2; Phase thickness: 0.25 μm |
Capillary | PONA | 60. | 691.0 | Krupcik, Skacani, et al., 1994 | H2; Phase thickness: 0.5 μm |
Capillary | PONA | 60. | 691.0 | Krupcik, Skacani, et al., 1994 | H2; Phase thickness: 0.5 μm |
Capillary | DB-1 | 60. | 691.2 | Krupcik, Skacani, et al., 1994 | H2; Phase thickness: 1. μm |
Capillary | OV-101 | 60. | 690.7 | Krupcik, Skacani, et al., 1994 | H2; Phase thickness: 0.2 μm |
Capillary | OV-101 | 40. | 686. | Laub and Purnell, 1988 | |
Capillary | OV-101 | 60. | 690. | Laub and Purnell, 1988 | |
Capillary | OV-101 | 80. | 693. | Laub and Purnell, 1988 | |
Capillary | Nonpolar | 55. | 690. | Stoyanov and Dimov, 1987 | |
Capillary | Nonpolar | 60. | 691. | Stoyanov and Dimov, 1987 | |
Capillary | Nonpolar | 65. | 692. | Stoyanov and Dimov, 1987 | |
Capillary | OV-101 | 40. | 687.1 | Boneva and Dimov, 1986 | 100. m/0.27 mm/0.9 μm |
Capillary | OV-101 | 50. | 688.8 | Boneva and Dimov, 1986 | 100. m/0.27 mm/0.9 μm |
Capillary | OV-101 | 60. | 690.5 | Boneva and Dimov, 1986 | 100. m/0.27 mm/0.9 μm |
Capillary | OV-101 | 70. | 692.2 | Boneva and Dimov, 1986 | 100. m/0.27 mm/0.9 μm |
Capillary | OV-101 | 30. | 685. | Chien, Furio, et al., 1983 | |
Capillary | OV-101 | 40. | 686. | Chien, Furio, et al., 1983 | |
Capillary | OV-101 | 50. | 688. | Chien, Furio, et al., 1983 | |
Capillary | OV-101 | 60. | 690. | Chien, Furio, et al., 1983 | |
Capillary | OV-101 | 70. | 691. | Chien, Furio, et al., 1983 | |
Capillary | OV-101 | 80. | 693. | Chien, Furio, et al., 1983 | |
Capillary | DB-1 | 60. | 690.9 | Lubeck and Sutton, 1983 | Column length: 60. m; Column diameter: 0.264 mm |
Capillary | DB-1 | 60. | 691.2 | Lubeck and Sutton, 1983 | 60. m/0.259 mm/1. μm |
Capillary | OV-101 | 50. | 689. | Johansen and Ettre, 1982 | 100. m/0.27 mm/0.20 μm |
Capillary | OV-101 | 50. | 689. | Johansen and Ettre, 1982 | 55. m/0.27 mm/0.9 μm |
Capillary | SF-96 | 50. | 690. | Johansen and Ettre, 1982 | 91.4 m/0.31 mm/0.20 μm |
Capillary | Squalane | 50. | 688. | Mitra, 1981 | N2; Column length: 100. m; Column diameter: 0.25 mm |
Capillary | Squalane | 50. | 689. | Mitra, 1981 | N2; Column length: 100. m; Column diameter: 0.25 mm |
Capillary | Squalane | 86. | 696.6 | Nabivach and Kirilenko, 1979 | N2; Column length: 50. m |
Capillary | Squalane | 100. | 692. | Lulova, Leont'eva, et al., 1976 | He; Column length: 120. m; Column diameter: 0.25 mm |
Capillary | Squalane | 100. | 691.6 | Lulova, Leont'eva, et al., 1976 | He; Column length: 120. m; Column diameter: 0.25 mm |
Capillary | Squalane | 100. | 691.6 | Lulova, Leont'eva, et al., 1976 | He; Column length: 120. m; Column diameter: 0.25 mm |
Capillary | Squalane | 100. | 697. | Dielmann, Schwengers, et al., 1974 | Column length: 100. m; Column diameter: 0.25 mm |
Capillary | Squalane | 60. | 691. | Dielmann, Schwengers, et al., 1974 | Column length: 100. m; Column diameter: 0.25 mm |
Capillary | Squalane | 80. | 695. | Dielmann, Schwengers, et al., 1974 | Column length: 100. m; Column diameter: 0.25 mm |
Capillary | Squalane | 50. | 689. | Rijks and Cramers, 1974 | N2; Column length: 100. m; Column diameter: 0.25 mm |
Capillary | Squalane | 70. | 692. | Rijks and Cramers, 1974 | N2; Column length: 100. m; Column diameter: 0.25 mm |
Capillary | Vacuum Grease Oil (VM-4) | 35. | 689. | Sidorov, Petrova, et al., 1972 | |
Capillary | Vacuum Grease Oil (VM-4) | 45. | 691. | Sidorov, Petrova, et al., 1972 | |
Capillary | Vacuum Grease Oil (VM-4) | 50. | 692. | Sidorov, Petrova, et al., 1972 | |
Capillary | Vacuum Grease Oil (VM-4) | 58. | 694. | Sidorov, Petrova, et al., 1972 | |
Capillary | Vacuum Grease Oil (VM-4) | 68. | 696. | Sidorov, Petrova, et al., 1972 | |
Capillary | Squalane | 70. | 689.8 | Dimov and Schopov, 1971 | Column length: 100. m; Column diameter: 0.25 mm |
Packed | Vacuum Grease Oil (VM-4) | 35. | 689. | Sidorov, Ivanova, et al., 1971 | |
Capillary | Squalane | 70. | 692. | Cramers, Rijks, et al., 1970 | Column length: 100. m; Column diameter: 0.25 mm |
Capillary | Squalane | 70. | 692. | Cramers, Rijks, et al., 1970 | Column length: 100. m; Column diameter: 0.25 mm |
Capillary | Squalane | 70. | 692. | Cramers, Rijks, et al., 1970 | Column length: 100. m; Column diameter: 0.25 mm |
Packed | SE-30 | 130. | 702. | Mitra and Saha, 1970 | N2, Chromosorb W; Column length: 6.1 m |
Packed | Squalane | 27. | 686. | Hively and Hinton, 1968 | He, Chromosorb P; Column length: 15. m; Column diameter: 0.25 mm |
Packed | Squalane | 49. | 690. | Hively and Hinton, 1968 | He, Chromosorb P; Column length: 15. m; Column diameter: 0.25 mm |
Packed | Squalane | 67. | 693. | Hively and Hinton, 1968 | He, Chromosorb P; Column length: 15. m; Column diameter: 0.25 mm |
Packed | Squalane | 86. | 696. | Hively and Hinton, 1968 | He, Chromosorb P; Column length: 15. m; Column diameter: 0.25 mm |
Capillary | Squalane | 70. | 693. | Schomburg, 1966 | |
Packed | Methyl Silicone | 130. | 702. | Antheaume and Guiochon, 1965 |

Kovats' RI, non-polar column, temperature ramp

Column type | Active phase | I | Reference | Comment |
---|---|---|---|---|
Capillary | Apiezon L | 700. | Louis, 1971 | N2, 1. K/min; Column length: 50. m; Column diameter: 0.25 mm; Tstart: 60. C |

Kovats' RI, non-polar column, custom temperature program

Column type | Active phase | I | Reference | Comment |
---|---|---|---|---|
Capillary | Petrocol DH-100 | 687. | Haagen-Smit Laboratory, 1997 | He; Column length: 100. m; Column diameter: 0.2 mm; Program: 5C(10min) => 5C/min => 50C(48min) => 1.5C/min => 195C(91min) |
Capillary | DB-1 | 687. | Hoekman, 1993 | 60. m/0.32 mm/1.0 μm, He; Program: -40 C for 12 min; -40 - 125 C at 3 deg.min; 125-185 C at 6 deg/min; 185 - 220 C at 20 deg/min; hold 220 C for 2 min |

Van Den Dool and Kratz RI, non-polar column, temperature ramp

Column type | Active phase | I | Reference | Comment |
---|---|---|---|---|
Capillary | Petrocol DH | 686.6 | Censullo, Jones, et al., 2003 | 50. m/0.25 mm/0.5 μm, He, 35. C @ 10. min, 3. K/min, 200. C @ 10. min |
Capillary | SPB-1 | 681.78 | LECO Corporation, 2003 | 30. m/0.25 mm/0.25 μm, 40. C @ 2. min, 10. K/min, 250. C @ 2. min |
Capillary | SPB-1 | 682.48 | LECO Corporation, 2003 | 30. m/0.25 mm/0.25 μm, 40. C @ 2. min, 10. K/min, 250. C @ 2. min |
Capillary | DB-5 | 690.9 | Xu, van Stee, et al., 2003 | 30. m/0.25 mm/1. μm, He, 2.5 K/min; Tstart: 50. C; Tend: 200. C |
Capillary | OV-101 | 686.0 | Yin, Liu, et al., 2001 | N2, 1. K/min; Column length: 80. m; Column diameter: 0.22 mm; Tstart: 30. C; Tend: 130. C |
Capillary | Petrocol DH | 684.12 | Subramaniam, Bochniak, et al., 1994 | 100. m/0.25 mm/0.5 μm, He, 1. K/min; Tstart: 30. C; Tend: 220. C |
Capillary | Petrocol DH | 684.18 | Subramaniam, Bochniak, et al., 1994 | 100. m/0.25 mm/0.5 μm, He, 1. K/min; Tstart: 30. C; Tend: 220. C |
Capillary | Petrocol DH | 683.95 | White, Douglas, et al., 1992 | 100. m/0.25 mm/0.5 μm, He, 1. K/min; Tstart: 30. C; Tend: 220. C |
Capillary | Petrocol DH | 684.01 | White, Douglas, et al., 1992 | 100. m/0.25 mm/0.5 μm, He, 1. K/min; Tstart: 30. C; Tend: 220. C |
Capillary | Petrocol DH | 684. | White, Hackett, et al., 1992 | 100. m/0.25 mm/0.5 μm, He, 1. K/min; Tstart: 30. C; Tend: 220. C |

Normal alkane RI, non-polar column, isothermal

Column type | Active phase | Temperature (C) | I | Reference | Comment |
---|---|---|---|---|---|
Capillary | Methyl Silicone | 50. | 689. | N/A | N2; Column length: 74.6 m; Column diameter: 0.28 mm |
Capillary | OV-101 | 50. | 689. | Wu and Lu, 1984 | |
Capillary | OV-101 | 70. | 692. | Wu and Lu, 1984 | |
Capillary | Squalane | 86. | 693. | Vigdergauz and Martynov, 1971 | He; Column length: 150. m; Column diameter: 0.35 mm |

Normal alkane RI, non-polar column, temperature ramp

Column type | Active phase | I | Reference | Comment |
---|---|---|---|---|
Capillary | Polydimethyl siloxane: CP-Sil 5 CB | 687. | Bramston-Cook, 2013 | 60. m/0.25 mm/1.0 μm, Helium, 45. C @ 1.45 min, 3.6 K/min, 210. C @ 2.72 min |
Capillary | Petrocol DH | 685. | Supelco, 2012 | 100. m/0.25 mm/0.50 μm, Helium, 20. C @ 15. min, 15. K/min, 220. C @ 30. min |
Capillary | PONA | 687. | Zhang, Ding, et al., 2009 | 50. m/0.20 mm/0.50 μm, Nitrogen, 35. C @ 15. min, 2. K/min, 200. C @ 10. min |

Normal alkane RI, non-polar column, custom temperature program

Column type | Active phase | I | Reference | Comment |
---|---|---|---|---|
Capillary | Squalane | 702. | Chen, 2008 | Program: not specified |
Capillary | Methyl Silicone | 689. | Feng and Mu, 2007 | Program: not specified |
Capillary | Methyl Silicone | 689. | Zenkevich and Marinichev, 2001 | Program: not specified |
Capillary | Methyl Silicone | 686. | Spieksma, 1999 | Program: not specified |
Capillary | OV-1, SE-30, Methyl silicone, SP-2100, OV-101, DB-1, etc. | 690. | Waggott and Davies, 1984 | Hydrogen; Column length: 50. m; Column diameter: 0.32 mm; Program: not specified |

References

Johnson, Prosen, et al., 1949
Johnson, W.H.; Prosen, E.J.; Rossini, F.D.,
Heats of combustion and isomerization of the six C7H14 alkylcyclopentanes,
J. Res. NBS, 1949, 42, 251-255. [all data]
Thermodynamics Research Center, 1997
Thermodynamics Research Center,
Selected Values of Properties of Chemical Compounds., Thermodynamics Research Center, Texas A&M University, College Station, Texas, 1997. [all data]
Epstein M.B., 1949
Epstein M.B.,
Heats, equilibrium constants, and free energies of formation of the dimethylcyclopentanes,
J. Res. Nat. Bur. Stand., 1949, 43, 245-250. [all data]
Huffman, Parks, et al., 1931
Huffman, H.M.; Parks, G.S.; Barmore, M.,
Thermal Data on Organic Compounds X. Further Studies on the Heat Capacities, Entropies, and Free Energies of Hydrocarbons,
J. Am. Chem. Soc., 1931, 53, 3876-88. [all data]
Parks and Huffman, 1931
Parks, G.S.; Huffman, H.M.,
Some fusion and transition data for hydrocarbons,
Ind. Eng. Chem., 1931, 23, 1138-9. [all data]
Reid, 1972
Reid, Robert C.,
Handbook on vapor pressure and heats of vaporization of hydrocarbons and related compounds, R. C. Wilhort and B. J. Zwolinski, Texas A Research Foundation. College Station, Texas(1971). 329 pages.$10.00,
AIChE J., 1972, 18, 6, 1278-1278, https://doi.org/10.1002/aic.690180637
. [all data]
Stephenson and Malanowski, 1987
Stephenson, Richard M.; Malanowski, Stanislaw,
Handbook of the Thermodynamics of Organic Compounds, 1987, https://doi.org/10.1007/978-94-009-3173-2
. [all data]
Forziati, Norris, et al., 1949
Forziati, Alphonse F.; Norris, William R.; Rossini, Frederick D.,
Vapor pressures and boiling points of sixty API-NBS hydrocarbons,
J. RES. NATL. BUR. STAN., 1949, 43, 6, 555-17, https://doi.org/10.6028/jres.043.050
. [all data]
Forziati, Norris, et al., 1949, 2
Forziati, A.F.; Norris, W.R.; Rossini, F.D.,
Vapor Pressures and Boiling Points of Sixty API-NBS Hydrocarbons,
J. Res. Natl. Bur. Stand. (U.S.), 1949, 43, 6, 555-563, https://doi.org/10.6028/jres.043.050
. [all data]
Allinger, Dodziuk, et al., 1982
Allinger, N.L.; Dodziuk, H.; Rogers, D.W.; Naik, S.N.,
Heats of hydrogenation and formation of some 5-membered ring compounds by molecular mechanics calculations and direct measurements,
Tetrahedron, 1982, 38, 1593-1597. [all data]
Roth, Adamczak, et al., 1991
Roth, W.R.; Adamczak, O.; Breuckmann, R.; Lennartz, H.-W.; Boese, R.,
Die Berechnung von Resonanzenergien; das MM2ERW-Kraftfeld,
Chem. Ber., 1991, 124, 2499-2521. [all data]