Cyclobutene
- Formula: C4H6
- Molecular weight: 54.0904
- IUPAC Standard InChIKey: CFBGXYDUODCMNS-UHFFFAOYSA-N
- CAS Registry Number: 822-35-5
- Chemical structure:
View 3d structure (requires JavaScript / HTML 5) - Permanent link for this species. Use this link for bookmarking this species for future reference.

Gas phase thermochemistry data

Data compiled as indicated in comments:
ALS - Hussein Y. Afeefy, Joel F. Liebman, and Stephen E. Stein
GT - Glushko Thermocenter, Russian Academy of Sciences, Moscow
Quantity | Value | Units | Method | Reference | Comment |
---|---|---|---|---|---|
ΔfH°gas | 157. ± 2. | kJ/mol | Cm | Wiberg and Fenoglio, 1968 | ALS |
Quantity | Value | Units | Method | Reference | Comment |
ΔcH°gas | -2588.2 ± 1.5 | kJ/mol | Cm | Wiberg and Fenoglio, 1968 | Corresponding ΔfHºgas = 156.7 kJ/mol (simple calculation by NIST; no Washburn corrections); ALS |
Constant pressure heat capacity of gas
Cp,gas (J/mol*K) | Temperature (K) | Reference | Comment |
---|---|---|---|
33.32 | 50. | Dorofeeva O.V., 1986 | Discrepancies between selected values and those calculated earlier [ Danti A., 1957] amount to 1.6-3.5 J/mol*K for S(T) and Cp(T).; GT |
35.05 | 100. | ||
38.61 | 150. | ||
44.70 | 200. | ||
58.74 | 273.15 | ||
64.4 ± 2.0 | 298.15 | ||
64.84 | 300. | ||
88.07 | 400. | ||
108.62 | 500. | ||
125.54 | 600. | ||
139.44 | 700. | ||
151.04 | 800. | ||
160.83 | 900. | ||
169.18 | 1000. | ||
176.34 | 1100. | ||
182.49 | 1200. | ||
187.80 | 1300. | ||
192.39 | 1400. | ||
196.38 | 1500. |

Phase change data

Data compiled as indicated in comments:
BS - Robert L. Brown and Stephen E. Stein
AC - William E. Acree, Jr., James S. Chickos
Quantity | Value | Units | Method | Reference | Comment |
---|---|---|---|---|---|
Tboil | 275.2 | K | N/A | Weast and Grasselli, 1989 | BS |
Enthalpy of vaporization
ΔvapH (kJ/mol) | Temperature (K) | Method | Reference | Comment |
---|---|---|---|---|
24.7 | 260. | A | Stephenson and Malanowski, 1987 | Based on data from 206. to 275. K.; AC |
24.6 | 260. | N/A | Heisig, 1941 | Based on data from 196. to 275. K. See also Boublik, Fried, et al., 1984.; AC |
Antoine Equation Parameters
log10(P) = A − (B / (T + C))
P = vapor pressure (bar)
T = temperature (K)
View plot Requires a JavaScript / HTML 5 canvas capable browser.
Temperature (K) | A | B | C | Reference | Comment |
---|---|---|---|---|---|
196.0 to 275.1 | 4.08259 | 1009.32 | -28.164 | Heisig, 1941 | Coefficents calculated by NIST from author's data. |

Reaction thermochemistry data

Data compiled by: John E. Bartmess
Individual Reactions
Quantity | Value | Units | Method | Reference | Comment |
---|---|---|---|---|---|
ΔrH° | 404.6 ± 1.5 | kcal/mol | CIDC | Tian, Fattahi, et al., 2006 | gas phase |
ΔrH° | 397.1 ± 5.1 | kcal/mol | G+TS | Kass, Filley, et al., 1986 | gas phase |
Quantity | Value | Units | Method | Reference | Comment |
ΔrG° | 396.5 ± 1.6 | kcal/mol | H-TS | Tian, Fattahi, et al., 2006 | gas phase |
ΔrG° | 389.0 ± 5.0 | kcal/mol | IMRB | Kass, Filley, et al., 1986 | gas phase |
(CAS Reg. No. 60211-41-8 • 4294967295) +
= CAS Reg. No. 60211-41-8
By formula: (CAS Reg. No. 60211-41-8 • 4294967295C4H6) + C4H6 = CAS Reg. No. 60211-41-8
Quantity | Value | Units | Method | Reference | Comment |
---|---|---|---|---|---|
ΔrH° | 13.7 ± 2.1 | kcal/mol | N/A | DePuy, Gronert, et al., 1989 | gas phase |

Gas phase ion energetics data

Data evaluated as indicated in comments:
HL - Edward P. Hunter and Sharon G. Lias
L - Sharon G. Lias
Data compiled as indicated in comments:
B - John E. Bartmess
LLK - Sharon G. Lias, Rhoda D. Levin, and Sherif A. Kafafi
RDSH - Henry M. Rosenstock, Keith Draxl, Bruce W. Steiner, and John T. Herron
Quantity | Value | Units | Method | Reference | Comment |
---|---|---|---|---|---|
IE (evaluated) | 9.43 ± 0.02 | eV | N/A | N/A | L |
Quantity | Value | Units | Method | Reference | Comment |
Proton affinity (review) | 187.5 | kcal/mol | N/A | Hunter and Lias, 1998 | HL |
Quantity | Value | Units | Method | Reference | Comment |
Gas basicity | 180.1 | kcal/mol | N/A | Hunter and Lias, 1998 | HL |
Ionization energy determinations
IE (eV) | Method | Reference | Comment |
---|---|---|---|
9.43 ± 0.02 | PE | Bieri, Burger, et al., 1977 | LLK |
9.43 | PE | Bischof and Heilbronner, 1970 | RDSH |
9.59 | PE | Wiberg, Ellison, et al., 1976 | Vertical value; LLK |
9.43 ± 0.03 | PE | Heilbronner, Hoshi, et al., 1976 | Vertical value; LLK |
9.43 | PE | Clary, Lewis, et al., 1974 | Vertical value; LLK |
De-protonation reactions
Quantity | Value | Units | Method | Reference | Comment |
---|---|---|---|---|---|
ΔrH° | 404.6 ± 1.5 | kcal/mol | CIDC | Tian, Fattahi, et al., 2006 | gas phase; B |
ΔrH° | 397.1 ± 5.1 | kcal/mol | G+TS | Kass, Filley, et al., 1986 | gas phase; B |
Quantity | Value | Units | Method | Reference | Comment |
ΔrG° | 396.5 ± 1.6 | kcal/mol | H-TS | Tian, Fattahi, et al., 2006 | gas phase; B |
ΔrG° | 389.0 ± 5.0 | kcal/mol | IMRB | Kass, Filley, et al., 1986 | gas phase; B |

Kovats' RI, non-polar column, isothermal

View large format table.

Column type Active phase Temperature (C) I Reference Comment
PackedSqualane27.432.Hively and Hinton, 1968He, Chromosorb P; Column length: 15. m; Column diameter: 0.25 mm
PackedSqualane49.433.Hively and Hinton, 1968He, Chromosorb P; Column length: 15. m; Column diameter: 0.25 mm
PackedSqualane67.433.Hively and Hinton, 1968He, Chromosorb P; Column length: 15. m; Column diameter: 0.25 mm
PackedSqualane86.434.Hively and Hinton, 1968He, Chromosorb P; Column length: 15. m; Column diameter: 0.25 mm

References

Wiberg and Fenoglio, 1968
Wiberg, K.B.; Fenoglio, R.A.,
Heats of formation of C4H6 hydrocarbons,
J. Am. Chem. Soc., 1968, 90, 3395-3397. [all data]
Dorofeeva O.V., 1986
Dorofeeva O.V.,
Thermodynamic properties of twenty-one monocyclic hydrocarbons,
J. Phys. Chem. Ref. Data, 1986, 15, 437-464. [all data]
Danti A., 1957
Danti A.,
Thermodynamic functions of cyclobutene,
J. Chem. Phys., 1957, 27, 1227. [all data]
Weast and Grasselli, 1989
CRC Handbook of Data on Organic Compounds, 2nd Editon, Weast,R.C and Grasselli, J.G., ed(s)., CRC Press, Inc., Boca Raton, FL, 1989, 1. [all data]
Stephenson and Malanowski, 1987
Stephenson, Richard M.; Malanowski, Stanislaw,
Handbook of the Thermodynamics of Organic Compounds, 1987, https://doi.org/10.1007/978-94-009-3173-2
. [all data]
Heisig, 1941
Heisig, G.B.,
The Preparation and the Vapor Pressures of Cyclobutene and Cyclobutane *,
J. Am. Chem. Soc., 1941, 63, 6, 1698-1699, https://doi.org/10.1021/ja01851a055
. [all data]
Boublik, Fried, et al., 1984
Boublik, T.; Fried, V.; Hala, E.,
The Vapour Pressures of Pure Substances: Selected Values of the Temperature Dependence of the Vapour Pressures of Some Pure Substances in the Normal and Low Pressure Region, 2nd ed., Elsevier, New York, 1984, 972. [all data]