Tridecane, 1-chloro-
- Formula: C13H27Cl
- Molecular weight: 218.806
- IUPAC Standard InChIKey: ASZMYJSJEOGSBR-UHFFFAOYSA-N
- CAS Registry Number: 822-13-9
- Chemical structure:
View 3d structure (requires JavaScript / HTML 5) - Other names: 1-chlorotridecane

Phase change data

Data compiled by: William E. Acree, Jr., James S. Chickos
Quantity | Value | Units | Method | Reference | Comment |
---|---|---|---|---|---|
ΔvapH° | 81.3 | kJ/mol | N/A | Bolotnikov and Neruchev, 2006 |
Enthalpy of vaporization
ΔvapH (kJ/mol) | Temperature (K) | Method | Reference | Comment |
---|---|---|---|---|
63.0 | 429. | A,EST | Stephenson and Malanowski, 1987 | Based on data from 414. to 611. K. See also Li and Rossini, 1961 and Dykyj and Vanko, 1970. |

References

Bolotnikov and Neruchev, 2006
Bolotnikov, M.F.; Neruchev, Yu.A.,
The enthalpies of vaporization and intermolecular interaction energies of 1-chloroalkanes,
Russ. J. Phys. Chem., 2006, 80, 8, 1191-1197, https://doi.org/10.1134/S0036024406080024
. [all data]
Stephenson and Malanowski, 1987
Stephenson, Richard M.; Malanowski, Stanislaw,
Handbook of the Thermodynamics of Organic Compounds, 1987, https://doi.org/10.1007/978-94-009-3173-2
. [all data]
Li and Rossini, 1961
Li, J.C.M.; Rossini, F.D.,
Vapor Pressures and Boiling Points of the l-Fluoroalkanes, l-Chloroalkanes, l-Bromoalkanes, and l-Iodoalkanes, C 1 to C 20 .,
J. Chem. Eng. Data, 1961, 6, 2, 268-270, https://doi.org/10.1021/je60010a025
. [all data]
Dykyj and Vanko, 1970
Dykyj, J.; Vanko, A.,
Petrochemica, 1970, 10, 1, 3. [all data]