1,11-Undecanediamine
- Formula: C11H26N2
- Molecular weight: 186.3375
- IUPAC Standard InChIKey: KLNPWTHGTVSSEU-UHFFFAOYSA-N
- CAS Registry Number: 822-08-2
- Chemical structure:
View 3d structure (requires JavaScript / HTML 5) - Other names: Undecamethylenediamine; 1,11-Diaminoundecane; Undecane-1,11-diamine

Phase change data

Data compiled by: William E. Acree, Jr., James S. Chickos
Enthalpy of fusion
ΔfusH (kJ/mol) | Temperature (K) | Method | Reference |
---|---|---|---|
48.08 | 313.6 | DSC | Dall'Acqua, Della Gatta, et al., 2002 |

References

Dall'Acqua, Della Gatta, et al., 2002
Dall'Acqua, Lorenzo; Della Gatta, Giuseppe; Nowicka, Bozenna; Ferloni, Paolo,
Enthalpies and entropies of fusion of ten alkane-α, ω-diamines H2 N-- (CH 2)n-- NH2 where 3≤n≤12,
The Journal of Chemical Thermodynamics, 2002, 34, 1, 1-12, https://doi.org/10.1006/jcht.2001.0950
. [all data]