3-(dodecylamino)propane-1,2-diol
- Formula: C15H33NO2
- Molecular weight: 259.4280
- IUPAC Standard InChIKey: VWGWFMQZURGKKK-UHFFFAOYSA-N
- CAS Registry Number: 821-91-0
- Chemical structure:
View 3d structure (requires JavaScript / HTML 5) - Other names: 3-(Dodecylamino)-1,2-propanediol

Phase change data

Data compiled as indicated in comments:
TRC - Thermodynamics Research Center, NIST Boulder Laboratories, Chris Muzny director
AC - William E. Acree, Jr., James S. Chickos
Quantity | Value | Units | Method | Reference | Comment |
---|---|---|---|---|---|
Tfus | 352. | K | N/A | van Doren and van der Geest, 1990 | Uncertainty assigned by TRC = 1.5 K; TRC |
Enthalpy of fusion
ΔfusH (kJ/mol) | Temperature (K) | Method | Reference | Comment |
---|---|---|---|---|
62.1 | 351.9 | DSC | Acree, 1993 | AC |

References

van Doren and van der Geest, 1990
van Doren, H.A.; van der Geest, R.,
A comparative study of the liquid-crystalline behavior of three homologous series of 1,2-propanediol derivatives,
Recl.: J. R. Neth. Chem. Soc., 1990, 109, 197. [all data]
Acree, 1993
Acree, William E.,
Thermodynamic properties of organic compounds,
Thermochimica Acta, 1993, 219, 97-104, https://doi.org/10.1016/0040-6031(93)80486-T
. [all data]