2-Butene-1,4-diol, (2E)-
- Formula: C4H8O2
- Molecular weight: 88.1051
- IUPAC Standard InChIKey: ORTVZLZNOYNASJ-OWOJBTEDSA-N
- CAS Registry Number: 821-11-4
- Chemical structure:
View 3d structure (requires JavaScript / HTML 5) - Stereoisomers:
- Other names: 2-BUTENE-1,4-DIOL TRANS; (E)-2-butene-1,4-diol

Phase change data

Data compiled by: Thermodynamics Research Center, NIST Boulder Laboratories, Chris Muzny director
Quantity | Value | Units | Method | Reference | Comment |
---|---|---|---|---|---|
Tfus | 300.5 | K | N/A | Smith, Eberly, et al., 1956 | Uncertainty assigned by TRC = 1. K |

References

Smith, Eberly, et al., 1956
Smith, W.M.; Eberly, K.C.; Hanson, E.E.; Binder, J.L.,
J. Am. Chem. Soc., 1956, 78, 626-630. [all data]