2-Butyne, 1,4-dichloro-
- Formula: C4H4Cl2
- Molecular weight: 122.981
- IUPAC Standard InChIKey: RCHDLEVSZBOHOS-UHFFFAOYSA-N
- CAS Registry Number: 821-10-3
- Chemical structure:
View 3d structure (requires JavaScript / HTML 5) - Other names: 1,4-Dichloro-2-butyne; 1,4-Dichlorobutyne; 1,4-dichlorobut-2-yne

Phase change data

Data compiled by: Robert L. Brown and Stephen E. Stein
Quantity | Value | Units | Method | Reference | Comment |
---|---|---|---|---|---|
Tboil | 438.7 | K | N/A | Weast and Grasselli, 1989 | |
Tboil | 438. to 441. | K | N/A | Frinton Laboratories Inc., 1986 |

References

Weast and Grasselli, 1989
CRC Handbook of Data on Organic Compounds, 2nd Editon, Weast,R.C and Grasselli, J.G., ed(s)., CRC Press, Inc., Boca Raton, FL, 1989, 1. [all data]
Frinton Laboratories Inc., 1986
Frinton Laboratories Inc.,
Catalog Number 11, Frinton Laboratories Inc., Vineland, NJ, 1986, 99. [all data]