1-Aceto-3-stearin

Phase change data

Data compiled as indicated in comments:
TRC - Thermodynamics Research Center, NIST Boulder Laboratories, Chris Muzny director
AC - William E. Acree, Jr., James S. Chickos

Quantity Value Units Method Reference Comment
Tfus320.KN/AWard, Vicknair, et al., 1955Uncertainty assigned by TRC = 0.1 K; TRC

Enthalpy of fusion

ΔfusH (kJ/mol) Temperature (K) Reference Comment
41.69319.9Domalski and Hearing, 1996AC

In addition to the Thermodynamics Research Center (TRC) data available from this site, much more physical and chemical property data is available from the following TRC products:

References

Ward, Vicknair, et al., 1955
Ward, T.L.; Vicknair, E.J.; Singleton, W.S.; Feuge, R.O., Some thermal properties of 1-monostearin, 1-aceto-3-stearin and 1,2-diaceto-3-stearin, J. Phys. Chem., 1955, 59, 4. [all data]

Domalski and Hearing, 1996
Domalski, Eugene S.; Hearing, Elizabeth D., Heat Capacities and Entropies of Organic Compounds in the Condensed Phase. Volume III, J. Phys. Chem. Ref. Data, 1996, 25, 1, 1, https://doi.org/10.1063/1.555985 . [all data]