2-(1,1-dimethylethyl)-3,3-dimethyl-1-butanol

Phase change data

Data compiled by: Thermodynamics Research Center, NIST Boulder Laboratories, Chris Muzny director

Quantity Value Units Method Reference Comment
Tfus324.65KN/AWhitmore, Whitaker, et al., 1941Uncertainty assigned by TRC = 1. K

In addition to the Thermodynamics Research Center (TRC) data available from this site, much more physical and chemical property data is available from the following TRC products:

References

Whitmore, Whitaker, et al., 1941
Whitmore, F.C.; Whitaker, J.S.; Mosher, W.A.; Breivik, O.N.; Wheeler, W.R.; Miner, C.S.; Sutherland, L.H.; Wagner, R.B.; Clapper, T.W.; Lewis, C.E.; Lux, A.R.; Popkin, A.H., J. Am. Chem. Soc., 1941, 63, 643. [all data]