Sebacic acid monomethyl ester
- Formula: C11H20O4
- Molecular weight: 216.2741
- IUPAC Standard InChIKey: OSYQOBUUFRGFNG-UHFFFAOYSA-N
- CAS Registry Number: 818-88-2
- Chemical structure:
View 3d structure (requires JavaScript / HTML 5) - Other names: Mono-methyl sebacate; Decanedioic acid, monomethyl ester; Methyl hydrogen sebacate; 10-Methoxy-10-oxodecanoic acid

Phase change data

Data compiled by: Thermodynamics Research Center, NIST Boulder Laboratories, Chris Muzny director
Quantity | Value | Units | Method | Reference | Comment |
---|---|---|---|---|---|
Tfus | 315.9 | K | N/A | Soffer, Strauss, et al., 1947 | Uncertainty assigned by TRC = 1. K |

Normal alkane RI, non-polar column, custom temperature program

Column type | Active phase | I | Reference | Comment |
---|---|---|---|---|
Capillary | HP-5 | 1683. | Zhao, Li, et al., 2008 | 30. m/0.25 mm/0.25 μm; Program: 40 0C (2 min) 5 0C/min -> 80 0C 7 oC/min -> 160 0C 9 0C/min -> 200 0C 20 0C/min -> 280 0C (10 min) |

References

Soffer, Strauss, et al., 1947
Soffer, M.D.; Strauss, N.S.; Trail, M.D.; Sherk, K.W.,
J. Am. Chem. Soc., 1947, 69, 1684. [all data]
Zhao, Li, et al., 2008
Zhao, Y.; Li, J.; Xu, Y.; Duan, H.; Fan, W.; Zhao, G.,
EXtraction, preparation and identification of volatile compounds in Changyu XO brandy,
Chinese J. Chromatogr., 2008, 26, 2, 212-222, https://doi.org/10.1016/S1872-2059(08)60014-0
. [all data]