8-Pentadecanone
- Formula: C15H30O
- Molecular weight: 226.3981
- IUPAC Standard InChIKey: PQYGSSYFJIJDFK-UHFFFAOYSA-N
- CAS Registry Number: 818-23-5
- Chemical structure:
View 3d structure (requires JavaScript / HTML 5) - Other names: Caprylone; Diheptyl ketone; Heptyl ketone; Pentadecan-8-one; di-n-Heptyl ketone; 8-Oxopentadecane; pentadecane-8-one

Phase change data

Data compiled as indicated in comments:
TRC - Thermodynamics Research Center, NIST Boulder Laboratories, Chris Muzny director
AC - William E. Acree, Jr., James S. Chickos
Quantity | Value | Units | Method | Reference | Comment |
---|---|---|---|---|---|
Tfus | 315.15 | K | N/A | Petrov and Andreev, 1937 | Uncertainty assigned by TRC = 1. K; TRC |
Enthalpy of vaporization
ΔvapH (kJ/mol) | Temperature (K) | Method | Reference | Comment |
---|---|---|---|---|
65.3 | 458. | A | Stephenson and Malanowski, 1987 | Based on data from 443. to 568. K.; AC |
65.4 | 458. | A | Stephenson and Malanowski, 1987 | Based on data from 443. to 589. K. See also Ambrose, Ellender, et al., 1975.; AC |
61.9 | 450. | A,ME | Stephenson and Malanowski, 1987 | Based on data from 438. to 462. K. See also Ubbelohde, 1938.; AC |
53.0 | 567. | N/A | Ambrose, Ellender, et al., 1975 | Based on data from 444. to 590. K.; AC |

Normal alkane RI, non-polar column, isothermal

View large format table.

Column type Active phase Temperature (C) I Reference Comment
CapillaryOV-160.1647.Amboni, Junkes, et al., 2002

Normal alkane RI, non-polar column, temperature ramp

View large format table.

Column type Active phase I Reference Comment
CapillaryOV-1011659.Zenkevich and Ventura, 1991Helium, 50. C @ 0. min, 5. K/min, 240. C @ 0. min; Column length: 54. m; Column diameter: 0.26 mm

Normal alkane RI, non-polar column, custom temperature program

View large format table.

Column type Active phase I Reference Comment
CapillaryPolydimethyl siloxane1647.Junkes, Castanho, et al., 2003Program: not specified

References

Petrov and Andreev, 1937
Petrov, A.D.; Andreev, D.N.,
The Action of Secondary Alkyl Halides Isopropylmagnesium Chloride, sec-Butylmagnesium Bromide, and sec-Amylmagnesium Chloride on Ethyl Caprylate,
J. Gen. Chem. USSR (Engl. Transl.), 1937, 7, 570. [all data]
Stephenson and Malanowski, 1987
Stephenson, Richard M.; Malanowski, Stanislaw,
Handbook of the Thermodynamics of Organic Compounds, 1987, https://doi.org/10.1007/978-94-009-3173-2
. [all data]
Ambrose, Ellender, et al., 1975
Ambrose, D.; Ellender, J.H.; Lees, E.B.; Sprake, C.H.S.; Townsend, R.,
Thermodynamic properties of organic oxygen compounds XXXVIII. Vapour pressures of some aliphatic ketones,
The Journal of Chemical Thermodynamics, 1975, 7, 5, 453-472, https://doi.org/10.1016/0021-9614(75)90275-X
. [all data]
Ubbelohde, 1938
Ubbelohde, A.R.,
Structure and thermodynamic properties of long-chain compounds,
Trans. Faraday Soc., 1938, 34, 282, https://doi.org/10.1039/tf9383400282
. [all data]