Acetic acid, ethoxy-, ethyl ester
- Formula: C6H12O3
- Molecular weight: 132.1577
- IUPAC Standard InChIKey: CKSRFHWWBKRUKA-UHFFFAOYSA-N
- CAS Registry Number: 817-95-8
- Chemical structure:
View 3d structure (requires JavaScript / HTML 5) - Other names: Ethoxyacetic acid ethyl ester; Ethyl ethoxyacetate; Ethyl 2-ethoxyacetate; EThyl ester of ethoxyacetic acid

Condensed phase thermochemistry data

Data compiled by: Hussein Y. Afeefy, Joel F. Liebman, and Stephen E. Stein
Quantity | Value | Units | Method | Reference | Comment |
---|---|---|---|---|---|
ΔfH°liquid | -639.5 ± 0.6 | kJ/mol | Ccb | Gutner, Lebedeva, et al., 1980 | |
Quantity | Value | Units | Method | Reference | Comment |
ΔcH°liquid | -3436.5 ± 0.6 | kJ/mol | Ccb | Gutner, Lebedeva, et al., 1980 | Corresponding ΔfHºliquid = -639.5 kJ/mol (simple calculation by NIST; no Washburn corrections) |

Phase change data

Data compiled as indicated in comments:
BS - Robert L. Brown and Stephen E. Stein
AC - William E. Acree, Jr., James S. Chickos
Reduced pressure boiling point
Tboil (K) | Pressure (bar) | Reference | Comment |
---|---|---|---|
333. to 334. | 0.024 | Frinton Laboratories Inc., 1986 | BS |
Enthalpy of vaporization
ΔvapH (kJ/mol) | Temperature (K) | Method | Reference | Comment |
---|---|---|---|---|
46.1 | 345. | A | Stephenson and Malanowski, 1987 | Based on data from 330. to 430. K.; AC |

References

Gutner, Lebedeva, et al., 1980
Gutner, N.M.; Lebedeva, N.D.; Dobychin, S.L.; Kiseleva, N.N.,
Thermochemical study of aliphatic ethers,
J. Appl. Chem. USSR, 1980, 53, 1523-1525. [all data]
Frinton Laboratories Inc., 1986
Frinton Laboratories Inc.,
Catalog Number 11, Frinton Laboratories Inc., Vineland, NJ, 1986, 99. [all data]
Stephenson and Malanowski, 1987
Stephenson, Richard M.; Malanowski, Stanislaw,
Handbook of the Thermodynamics of Organic Compounds, 1987, https://doi.org/10.1007/978-94-009-3173-2
. [all data]