1,2,2,3-tetrafluoropropane
- Formula: C3H4F4
- Molecular weight: 116.0575
- IUPAC Standard InChIKey: KRMPWJLLJZSRLO-UHFFFAOYSA-N
- CAS Registry Number: 813-75-2
- Chemical structure:
View 3d structure (requires JavaScript / HTML 5) - Permanent link for this species. Use this link for bookmarking this species for future reference.

Phase change data

Data compiled by: Thermodynamics Research Center, NIST Boulder Laboratories, Chris Muzny director
Quantity | Value | Units | Method | Reference | Comment |
---|---|---|---|---|---|
Tboil | 300.2 | K | N/A | Rausch, Davis, et al., 1963 | Uncertainty assigned by TRC = 2. K |

References

Rausch, Davis, et al., 1963
Rausch, D.A.; Davis, R.A.; Osborne, D.W.,
The Addition of Fluorine to Halogenated Olefins by Means of Metal Fluorides,
J. Org. Chem., 1963, 28, 494. [all data]