Cholic acid

Phase change data

Data compiled by: Thermodynamics Research Center, NIST Boulder Laboratories, Chris Muzny director

Quantity Value Units Method Reference Comment
Tfus439.KN/AHuang-Minlon, 1949Uncertainty assigned by TRC = 4. K

In addition to the Thermodynamics Research Center (TRC) data available from this site, much more physical and chemical property data is available from the following TRC products:

References

Huang-Minlon, 1949
Huang-Minlon, Reduction of Steroid Ketones and Other Carbonyl Compounds by Modified Wolff-Kishner Method, J. Am. Chem. Soc., 1949, 71, 3301. [all data]