1,1-Dimethylhydrazinium tetrafluoroborate
- Formula: C2H9BF4N2
- Molecular weight: 147.911
- IUPAC Standard InChIKey: INNMAKMNPHJYNO-UHFFFAOYSA-O
- CAS Registry Number: 811-64-3
- Chemical structure:
View 3d structure (requires JavaScript / HTML 5) - Permanent link for this species. Use this link for bookmarking this species for future reference.

Phase change data

Data compiled by: Eugene S. Domalski and Elizabeth D. Hearing
Temperature of phase transition
Ttrs (K) | Initial Phase | Final Phase | Reference | Comment |
---|---|---|---|---|
265. | crystaline, III | crystaline, II | Ishida, Takagi, et al., 1992 | S = 9.5 J/mol*K |
268. | crystaline, II | crystaline, I | Ishida, Takagi, et al., 1992 | S = 21 J/mol*K |
415. | crystaline, I | liquid | Ishida, Takagi, et al., 1992 | S = 11 J/mol*K |

References

Ishida, Takagi, et al., 1992
Ishida, H.; Takagi, K.; Ikeda, R.,
An ionic plastic phase of 1,1-dimethylhydrazinium tetrafluoroborate revealed by proton and fluorine-19 NMR and thermal measurements,
Chem. Lett., 1992, (4), 605-608. [all data]