ethyllithium
- Formula: C2H5Li
- Molecular weight: 36.002
- IUPAC Standard InChIKey: BLHLJVCOVBYQQS-UHFFFAOYSA-N
- CAS Registry Number: 811-49-4
- Chemical structure:
View 3d structure (requires JavaScript / HTML 5) - Permanent link for this species. Use this link for bookmarking this species for future reference.

Gas phase thermochemistry data

Data compiled by: José A. Martinho Simões
Quantity | Value | Units | Method | Reference | Comment |
---|---|---|---|---|---|
ΔfH°gas | 63.7 ± 2.2 | kJ/mol | Review | Martinho Simões | |
ΔfH°gas | 58.0 ± 5.5 | kJ/mol | Review | Martinho Simões |

Condensed phase thermochemistry data

Data compiled by: José A. Martinho Simões
Quantity | Value | Units | Method | Reference | Comment |
---|---|---|---|---|---|
ΔfH°solid | -53.0 ± 2.0 | kJ/mol | Review | Martinho Simões | |
ΔfH°solid | -58.7 ± 5.4 | kJ/mol | Review | Martinho Simões | |
Quantity | Value | Units | Method | Reference | Comment |
ΔcH°solid | -1741.8 ± 5.4 | kJ/mol | CC-SB | Lebedev, Miroshnichenko, et al., 1962 | Please also see Pedley and Rylance, 1977 and Cox and Pilcher, 1970. |

Phase change data

Data compiled as indicated in comments:
MS - José A. Martinho Simões
AC - William E. Acree, Jr., James S. Chickos
Quantity | Value | Units | Method | Reference | Comment |
---|---|---|---|---|---|
ΔsubH° | 116.7 ± 0.8 | kJ/mol | RSC | Chaikin, 1962 | MS |
Enthalpy of sublimation
ΔsubH (kJ/mol) | Temperature (K) | Method | Reference | Comment |
---|---|---|---|---|
116.6 | 315.5 | A | Stephenson and Malanowski, 1987 | Based on data from 298. to 333. K. See also Chaikin, 1962.; AC |

Reaction thermochemistry data

Data compiled by: José A. Martinho Simões
Individual Reactions
By formula: HBr (g) + C2H5Li (cr) = C2H6 (g) + BrLi (cr)
Quantity | Value | Units | Method | Reference | Comment |
---|---|---|---|---|---|
ΔrH° | -345.7 ± 2.0 | kJ/mol | RSC | Holm, 1974 | Please also see Pedley and Rylance, 1977. The reaction enthalpy was quoted from Pedley and Rylance, 1977. See Liebman, Martinho Simões, et al., 1995 for comments |

References

Martinho Simões
Martinho Simões, J.A.,
Private communication (see http://webbook.nist.gov/chemistry/om/). [all data]
Lebedev, Miroshnichenko, et al., 1962
Lebedev, Y.A.; Miroshnichenko, E.A.; Chaikin, A.M.,
Dokl. Akad. Nauk SSSR, 1962, 145, 1288. [all data]
Pedley and Rylance, 1977
Pedley, J.B.; Rylance, J.,
Computer Analysed Thermochemical Data: Organic and Organometallic Compounds, University of Sussex, Brigton, 1977. [all data]
Cox and Pilcher, 1970
Cox, J.D.; Pilcher, G.,
Thermochemistry of Organic and Organometallic Compounds
in Academic Press, New York, 1970. [all data]
Chaikin, 1962
Chaikin, A.M.,
Zh. Fiz. Khim., 1962, 36, 130. [all data]
Stephenson and Malanowski, 1987
Stephenson, Richard M.; Malanowski, Stanislaw,
Handbook of the Thermodynamics of Organic Compounds, 1987, https://doi.org/10.1007/978-94-009-3173-2
. [all data]
Holm, 1974
Holm, T.,
J. Organometal. Chem., 1974, 77, 27. [all data]
Liebman, Martinho Simões, et al., 1995
Liebman, J.F.; Martinho Simões, J.A.; Slayden, S.W.,
In Lithium Chemistry: A Theoretical and Experimental Overview Wiley: New York, Sapse, A.-M.; Schleyer, P. von Ragué, ed(s)., 1995. [all data]