Lathosterol
- Formula: C27H46O
- Molecular weight: 386.6535
- IUPAC Standard InChIKey: IZVFFXVYBHFIHY-VMTNTMNISA-N
- CAS Registry Number: 80-99-9
- Chemical structure:
View 3d structure (requires JavaScript / HTML 5) - Stereoisomers:
- Other names: Cholest-7-en-3-ol, (3β,5α)-; 5α-Cholest-7-en-3β-ol; 3β-Hydroxy-5α-cholest-7-ene; 7-Cholesten-3-β-ol; Cholesterin; Δ7-Cholestenol; Cholest-7-en-3-ol

Kovats' RI, non-polar column, isothermal

Column type | Active phase | Temperature (C) | I | Reference | Comment |
---|---|---|---|---|---|
Capillary | Methyl Silicone | 250. | 3170. | Shlyakhov, 1984 |

References

Shlyakhov, 1984
Shlyakhov, A.F.,
Gas chromatography in organic geochemistry, Nedra, Moscow, 1984, 221. [all data]