2-Propionyl-3,4,5,6-tetrahydropyridine
- Formula: C8H13NO
- Molecular weight: 139.1949
- IUPAC Standard InChIKey: GGYSXLMPBBMRHY-UHFFFAOYSA-N
- CAS Registry Number: 80933-75-1
- Chemical structure:
View 3d structure (requires JavaScript / HTML 5) - Permanent link for this species. Use this link for bookmarking this species for future reference.

Van Den Dool and Kratz RI, non-polar column, custom temperature program

Column type | Active phase | I | Reference | Comment |
---|---|---|---|---|
Capillary | SE-54 | 1148. | Hofmann and Schieberle, 1998 | 30. m/0.32 mm/0.25 μm, He; Program: 40C(2min) => 40C/min => 50C(5min) => 6C/min => 230(15min) |

References

Hofmann and Schieberle, 1998
Hofmann, T.; Schieberle, P.,
Flavor contribution and formation of the intense roast-smelling odorants 2-propionyl-1-pyrroline and 2-propionyltetrahydropyridine in Maillard-type reactions,
J. Agric. Food Chem., 1998, 46, 7, 2721-2726, https://doi.org/10.1021/jf971101s
. [all data]