dl-Threonine
- Formula: C4H9NO3
- Molecular weight: 119.1192
- IUPAC Standard InChIKey: AYFVYJQAPQTCCC-UHFFFAOYSA-N
- CAS Registry Number: 80-68-2
- Chemical structure:
- Other names: DL-2-Amino-3-hydroxybutanoic acid; Threonine, DL-

Condensed phase thermochemistry data

Data compiled by: Hussein Y. Afeefy, Joel F. Liebman, and Stephen E. Stein
Quantity | Value | Units | Method | Reference | Comment |
---|---|---|---|---|---|
ΔcH°solid | -2101.5 ± 0.42 | kJ/mol | Ccb | Ponomarev and Migarskaya, 1960 | Reanalyzed by Cox and Pilcher, 1970, Original value = -2102.2 ± 0.08 kJ/mol |

Reaction thermochemistry data

Data compiled by: Robert C. Dunbar
Individual Reactions
By formula: Na+ + C4H9NO3 = (Na+ • C4H9NO3)
Quantity | Value | Units | Method | Reference | Comment |
---|---|---|---|---|---|
ΔrH° | 197. | kJ/mol | CIDC | Kish, Ohanessian, et al., 2003 | Anchor alanine=39.89 |

Ion clustering data

Data compiled by: Robert C. Dunbar
Clustering reactions
By formula: Na+ + C4H9NO3 = (Na+ • C4H9NO3)
Quantity | Value | Units | Method | Reference | Comment |
---|---|---|---|---|---|
ΔrH° | 197. | kJ/mol | CIDC | Kish, Ohanessian, et al., 2003 | Anchor alanine=39.89 |

References

Ponomarev and Migarskaya, 1960
Ponomarev, V.V.; Migarskaya, L.B.,
Heats of combustion of some amino-acids,
Russ. J. Phys. Chem. (Engl. Transl.), 1960, 34, 1182-1183. [all data]
Cox and Pilcher, 1970
Cox, J.D.; Pilcher, G.,
Thermochemistry of Organic and Organometallic Compounds, Academic Press, New York, 1970, 1-636. [all data]
Kish, Ohanessian, et al., 2003
Kish, M.M.; Ohanessian, G.; Wesdemiotis, C.,
The Na+ affinities of a-amino acids: side-chain substituent effects,
Int. J. Mass Spectrom., 2003, 227, 3, 509, https://doi.org/10.1016/S1387-3806(03)00082-4
. [all data]
Seidel and Waldman, 1952
Seidel, L.J.; Waldman, S.,
J. Biol. Chem., 1952, 197, 285. [all data]