2-Propenoic acid, 2-chloro-, methyl ester

Kovats' RI, non-polar column, isothermal

Data compiled by: NIST Mass Spectrometry Data Center, William E. Wallace, director

Column type Capillary
Active phase SE-30
Column length (m) 25.
Carrier gas
Substrate
Column diameter (mm) 0.22
Phase thickness (μm)
Temperature (C) 80.
I 748.
ReferenceHaken and Korhonen, 1983
Comment MSDC-RI

References

Haken and Korhonen, 1983
Haken, J.K.; Korhonen, I.O.O., Gas chromatography of homologous esters. XXIII. Capillary column studies of chlorinated methyl propenoates, J. Chromatogr., 1983, 268, 511-514, https://doi.org/10.1016/S0021-9673(01)95451-2 . [all data]