2-Bromobutyric acid
- Formula: C4H7BrO2
- Molecular weight: 167.001
- IUPAC Standard InChIKey: YAQLSKVCTLCIIE-UHFFFAOYSA-N
- CAS Registry Number: 80-58-0
- Chemical structure:
View 3d structure (requires JavaScript / HTML 5) - Other names: α-Bromobytyric acid; α-Bromo-n-butyric acid; Butanoic acid, 2-bromo-; Butyric acid, α-bromo-; Butyric acid, 2-bromo-; 2-Bromobutanoic acid; dl-2-Bromobutyric acid

Phase change data

Data compiled by: Robert L. Brown and Stephen E. Stein
Reduced pressure boiling point
Tboil (K) | Pressure (bar) | Reference |
---|---|---|
374.2 | 0.013 | Aldrich Chemical Company Inc., 1990 |
363. to 366. | 0.013 | Buckingham and Donaghy, 1982 |

Gas phase ion energetics data

Data compiled by: John E. Bartmess
De-protonation reactions
C4H6BrO2- + =
By formula: C4H6BrO2- + H+ = C4H7BrO2
Quantity | Value | Units | Method | Reference | Comment |
---|---|---|---|---|---|
ΔrH° | 1409. ± 8.8 | kJ/mol | G+TS | Caldwell, Renneboog, et al., 1989 | gas phase |
ΔrH° | 1407. ± 8.8 | kJ/mol | G+TS | Caldwell, McMahon, et al., 1985 | gas phase |
Quantity | Value | Units | Method | Reference | Comment |
ΔrG° | 1380. ± 8.4 | kJ/mol | IMRE | Caldwell, Renneboog, et al., 1989 | gas phase |
ΔrG° | 1378. ± 8.4 | kJ/mol | IMRE | Caldwell, McMahon, et al., 1985 | gas phase |

References

Aldrich Chemical Company Inc., 1990
Aldrich Chemical Company Inc.,
Catalog Handbook of Fine Chemicals, Aldrich Chemical Company, Inc., Milwaukee WI, 1990, 1. [all data]
Buckingham and Donaghy, 1982
Buckingham, J.; Donaghy, S.M.,
Dictionary of Organic Compounds: Fifth Edition, Chapman and Hall, New York, 1982, 1. [all data]
Caldwell, Renneboog, et al., 1989
Caldwell, G.; Renneboog, R.; Kebarle, P.,
Gas Phase Acidities of Aliphatic Carboxylic Acids, Based on Measurements of Proton Transfer Equilibria,
Can. J. Chem., 1989, 67, 4, 661, https://doi.org/10.1139/v89-092
. [all data]
Caldwell, McMahon, et al., 1985
Caldwell, G.; McMahon, T.B.; Kebarle, P.; Bartmess, J.E.; Kiplinger, J.P.,
Methyl substituent effects in the gas phase acidities of halosubstituted oxygen acids. A realignment with substituent effects in solution,
J. Am. Chem. Soc., 1985, 107, 80. [all data]