4,4'-oxydi(benzenesulphonohydrazide)
- Formula: C12H14N4O5S2
- Molecular weight: 358.393
- IUPAC Standard InChIKey: NBOCQTNZUPTTEI-UHFFFAOYSA-N
- CAS Registry Number: 80-51-3
- Chemical structure:
View 3d structure (requires JavaScript / HTML 5) - Other names: 4,4'-Oxydibenzenesulfonyl hydrazide

Condensed phase thermochemistry data

Data compiled by: Hussein Y. Afeefy, Joel F. Liebman, and Stephen E. Stein
Quantity | Value | Units | Method | Reference | Comment |
---|---|---|---|---|---|
ΔcH°solid | -6201.1 | kJ/mol | Ccb | Reed, 1960 |

References

Reed, 1960
Reed, R.A.,
New blowing agents for foaming plastics,
British Plastics, 1960, 33, 468-472. [all data]