Benzene, 1-chloro-3,5-bis(1,1-dimethylethyl)-
- Formula: C14H21Cl
- Molecular weight: 224.770
- IUPAC Standard InChIKey: UMPNQCBQSXTKID-UHFFFAOYSA-N
- CAS Registry Number: 80438-67-1
- Chemical structure:

Reaction thermochemistry data

Data compiled by: Hussein Y. Afeefy, Joel F. Liebman, and Stephen E. Stein
Individual Reactions
By formula: C6H5Cl + C14H21Cl = 2C10H13Cl
Quantity | Value | Units | Method | Reference | Comment |
---|---|---|---|---|---|
ΔrH° | 0. ± 0.02 | kcal/mol | Eqk | Kovzel, Nesterova, et al., 1981 | liquid phase |

Condensed phase thermochemistry data

Data compiled by: Hussein Y. Afeefy, Joel F. Liebman, and Stephen E. Stein

Quantity Value Units Method Reference Comment
Δfliquid-229. ± 2.kJ/molEqkKovel, Nesterova, et al., 1982

References

Kovzel, Nesterova, et al., 1981
Kovzel, E.N.; Nesterova, T.N.; Rozhnov, A.M.; Kartavtseva, T.A.,
Study of equilibrium in in the chlorobenzene-butylchlorobenzenes systems,
Termodin. Organ. Soedin., 1981, 65-68. [all data]