Benzenesulfonic acid, 4-methyl-, ethyl ester
- Formula: C9H12O3S
- Molecular weight: 200.255
- IUPAC Standard InChIKey: VRZVPALEJCLXPR-UHFFFAOYSA-N
- CAS Registry Number: 80-40-0
- Chemical structure:
View 3d structure (requires JavaScript / HTML 5) - Other names: p-Toluenesulfonic acid, ethyl ester; Ethyl p-methylbenzenesulfonate; Ethyl p-toluenesulfonate; Ethyl p-tosylate; Ethyl tosylate; Ethyl para-toluenesulfonate; Ethyl 4-toluenesulfonate; Ethyl toluene-4-sulfonate; p-Toluolsulfonsaeure aethyl ester; Ethyl p-TS; Ethylester kyseliny p-toluensulfonove; Ethyl ester of p-Toluenesulfonic acid; 4-Methylbenzenesulfonic acid ethyl ester; Mittel AEP; NSC 8887; Toluene-4-sulfonic acid ethyl ester; ethyl toluene-4-sulphonate

Phase change data

Data compiled by: Thermodynamics Research Center, NIST Boulder Laboratories, Chris Muzny director
Quantity | Value | Units | Method | Reference | Comment |
---|---|---|---|---|---|
Tfus | 304. | K | N/A | Preston and Clark, 1960 | Uncertainty assigned by TRC = 4. K |
Tfus | 307.0 | K | N/A | Winstein and Marshall, 1952 | Uncertainty assigned by TRC = 2. K |

References

Preston and Clark, 1960
Preston, J.; Clark, H.G.,
, 1960. [all data]
Winstein and Marshall, 1952
Winstein, S.; Marshall, H.,
Neighboring Carbon and Hydrogen VI. Formolysis and Other Solvolysis Rates of Some Simple Secondary and Primary Benzenesulfonates,
J. Am. Chem. Soc., 1952, 74, 1120-6. [all data]