Benzenesulfonic acid, hydrazide
- Formula: C6H8N2O2S
- Molecular weight: 172.205
- IUPAC Standard InChIKey: VJRITMATACIYAF-UHFFFAOYSA-N
- CAS Registry Number: 80-17-1
- Chemical structure:

Condensed phase thermochemistry data

Data compiled by: Hussein Y. Afeefy, Joel F. Liebman, and Stephen E. Stein
Quantity | Value | Units | Method | Reference | Comment |
---|---|---|---|---|---|
ΔcH°solid | -3607. | kJ/mol | Ccb | Reed, 1960 |

References

Reed, 1960
Reed, R.A.,
New blowing agents for foaming plastics,
British Plastics, 1960, 33, 468-472. [all data]