Hydroperoxide, 1-methyl-1-phenylethyl

Phase change data

Data compiled as indicated in comments:
BS - Robert L. Brown and Stephen E. Stein
AC - William E. Acree, Jr., James S. Chickos
ALS - Hussein Y. Afeefy, Joel F. Liebman, and Stephen E. Stein
DRB - Donald R. Burgess, Jr.

Quantity Value Units Method Reference Comment
Δvap69.9kJ/molAStephenson and Malanowski, 1987Based on data from 283. - 333. K.; AC
Δvap69.9 ± 0.2kJ/molVKozlov and Rabinovich, 1964ALS
Δvap70.3kJ/molN/AKozlov and Rabinovich, 1964DRB

Reduced pressure boiling point

Tboil (K) Pressure (bar) Reference Comment
373.70.01Aldrich Chemical Company Inc., 1990BS

Enthalpy of vaporization

ΔvapH (kJ/mol) Temperature (K) Method Reference Comment
74.0362.AStephenson and Malanowski, 1987Based on data from 347. - 390. K.; AC

Condensed phase thermochemistry data

Data compiled by: Hussein Y. Afeefy, Joel F. Liebman, and Stephen E. Stein

Quantity Value Units Method Reference Comment
Δfliquid-149. ± 6.7kJ/molCcbKozlov and Rabinovich, 1964
Quantity Value Units Method Reference Comment
Δcliquid-5108.2 ± 6.7kJ/molCcbKozlov and Rabinovich, 1964Corresponding Δfliquid = -149. kJ/mol (simple calculation by NIST; no Washburn corrections)
Quantity Value Units Method Reference Comment
Δfsolid-192.kJ/molCcbBaroody and Carpenter, 1972

References

Stephenson and Malanowski, 1987
Stephenson, Richard M.; Malanowski, Stanislaw, Handbook of the Thermodynamics of Organic Compounds, 1987, https://doi.org/10.1007/978-94-009-3173-2 . [all data]

Kozlov and Rabinovich, 1964
Kozlov, N.A.; Rabinovich, I.B., Thermodynamics of isopropylbenzene and tert-butyl hydroperoxides. I. Heat of combustion and the formation of hydroperoxides; [bond] energy of oxygen-oxygen bond, Tr. Khim. Khim. Tekhnol., 1964, 189-193. [all data]

Aldrich Chemical Company Inc., 1990
Aldrich Chemical Company Inc., Catalog Handbook of Fine Chemicals, Aldrich Chemical Company, Inc., Milwaukee WI, 1990, 1. [all data]