Cyclopenta-2,4-dien-1-ol
- Formula: C5H6O
- Molecular weight: 82.1005
- IUPAC Standard InChIKey: GRZIHXUWTOPZRY-UHFFFAOYSA-N
- CAS Registry Number: 80156-16-7
- Chemical structure:

Gas phase thermochemistry data

Data compiled by: Glushko Thermocenter, Russian Academy of Sciences, Moscow
Constant pressure heat capacity of gas
Cp,gas (cal/mol*K) | Temperature (K) | Reference | Comment |
---|---|---|---|
10.40 | 100. | Karni M., 1991 | These thermodynamic functions were obtained by ab initio calculations. |
15.20 | 200. | ||
21.85 | 298.15 | ||
21.99 | 300. | ||
28.779 | 400. | ||
34.479 | 500. | ||
39.037 | 600. | ||
42.701 | 700. | ||
45.710 | 800. | ||
48.224 | 900. | ||
50.354 | 1000. | ||
52.170 | 1100. | ||
53.731 | 1200. | ||
55.074 | 1300. | ||
56.238 | 1400. | ||
57.249 | 1500. | ||
58.129 | 1600. | ||
58.901 | 1700. | ||
59.577 | 1800. | ||
60.172 | 1900. | ||
60.700 | 2000. |

References

Karni M., 1991
Karni M.,
Ab initio calculations and ideal gas thermodynamic functions of cyclopentadiene and cyclopentadiene derivatives,
J. Phys. Chem. Ref. Data, 1991, 20, 665-683. [all data]