Ionone
- Formula: C13H20O
- Molecular weight: 192.2973
- IUPAC Standard InChIKey: UZFLPKAIBPNNCA-BQYQJAHWSA-N
- CAS Registry Number: 8013-90-9
- Chemical structure:
View 3d structure (requires JavaScript / HTML 5) - Species with the same structure:
- Other names: Iraldeine; Irisone

Van Den Dool and Kratz RI, non-polar column, temperature ramp

Column type | Active phase | I | Reference | Comment |
---|---|---|---|---|
Capillary | DB-5 | 1422. | Gómez, Ledbetter, et al., 1993 | He, 4. K/min; Column length: 30. m; Column diameter: 0.25 mm; Tstart: 50. C; Tend: 250. C |
Capillary | DB-1 | 1423.6 | Chang, Sheng, et al., 1989 | 2. K/min; Column length: 30. m; Column diameter: 0.25 mm; Tstart: 50. C; Tend: 300. C |
Capillary | DB-1 | 1424.0 | Chang, Sheng, et al., 1989 | 2. K/min; Column length: 30. m; Column diameter: 0.25 mm; Tstart: 50. C; Tend: 300. C |
Capillary | DB-1 | 1423.6 | Chang, Sheng, et al., 1989 | 2. K/min; Column length: 30. m; Column diameter: 0.25 mm; Tstart: 50. C; Tend: 300. C |
Capillary | DB-1 | 1424.3 | Chang, Sheng, et al., 1989 | 2. K/min; Column length: 30. m; Column diameter: 0.25 mm; Tstart: 50. C; Tend: 300. C |

Van Den Dool and Kratz RI, polar column, temperature ramp

Column type | Active phase | I | Reference | Comment |
---|---|---|---|---|
Capillary | DB-Wax | 1842.3 | Chang, Sheng, et al., 1989 | 2. K/min; Column length: 30. m; Column diameter: 0.25 mm; Tstart: 50. C; Tend: 240. C |
Capillary | DB-Wax | 1846.2 | Chang, Sheng, et al., 1989 | 2. K/min; Column length: 30. m; Column diameter: 0.25 mm; Tstart: 50. C; Tend: 240. C |

Normal alkane RI, non-polar column, custom temperature program

Column type | Active phase | I | Reference | Comment |
---|---|---|---|---|
Capillary | RTX-5 MS | 1433. | Mebazaa, Mahmoudi, et al., 2009 | 30. m/0.25 mm/0.25 μm, Helium; Program: 50 0C (5 min) 2 0C/min -> 100 0C (5 min) 5 0C/min -> 300 0C |
Capillary | RTX-5 MS | 1426. | Mebazaa, Mahmoudi, et al., 2009 | 30. m/0.25 mm/0.25 μm, Helium; Program: not specified |

References

Gómez, Ledbetter, et al., 1993
Gómez, E.; Ledbetter, C.A.; Hartsell, P.L.,
Volatile compounds in apricot, plum, and their interspecific hybrids,
J. Agric. Food Chem., 1993, 41, 10, 1669-1676, https://doi.org/10.1021/jf00034a029
. [all data]
Chang, Sheng, et al., 1989
Chang, L.P.; Sheng, L.S.; Yang, M.Z.; An, D.K.,
Retention index of essential oil in temperature-programmed capillary column gas chromatography,
Acta Pharm. Sin., 1989, 24, 11, 847-852. [all data]
Mebazaa, Mahmoudi, et al., 2009
Mebazaa, R.; Mahmoudi, A.; Fouchet, M.; Dos Santos, M.; Kamissoko, F.; Nafti, A.; Ben Cheikh, R.; Rega, B.; Camel, V.,
Characterization of volatile compounds in Tunisian fenugreek seeds,
Food Chem., 2009, 115, 4, 1326-1336, https://doi.org/10.1016/j.foodchem.2009.01.066
. [all data]