Silane, dichlorodiphenyl-
- Formula: C12H10Cl2Si
- Molecular weight: 253.199
- IUPAC Standard InChIKey: OSXYHAQZDCICNX-UHFFFAOYSA-N
- CAS Registry Number: 80-10-4
- Chemical structure:

Phase change data

Data compiled as indicated in comments:
AC - William E. Acree, Jr., James S. Chickos
Enthalpy of vaporization
ΔvapH (kcal/mol) | Temperature (K) | Method | Reference | Comment |
---|---|---|---|---|
14.9 | 480. | A,I | Stephenson and Malanowski, 1987 | Based on data from 465. to 555. K. See also Jenkins and Chambers, 1954.; AC |
Antoine Equation Parameters
log10(P) = A − (B / (T + C))
P = vapor pressure (atm)
T = temperature (K)
View plot Requires a JavaScript / HTML 5 canvas capable browser.
Temperature (K) | A | B | C | Reference |
---|---|---|---|---|
465.3 to 554.4 | 4.0740 | 1884. | -115. | Jenkins and Chambers, 1954 |

References

Stephenson and Malanowski, 1987
Stephenson, Richard M.; Malanowski, Stanislaw,
Handbook of the Thermodynamics of Organic Compounds, 1987, https://doi.org/10.1007/978-94-009-3173-2
. [all data]
Jenkins and Chambers, 1954
Jenkins, Arthur C.; Chambers, George F.,
Vapor Pressures of Silicon Compounds,
Ind. Eng. Chem., 1954, 46, 11, 2367-2369, https://doi.org/10.1021/ie50539a043
. [all data]