Phenol, 4,4'-(1-methylethylidene)bis-
- Formula: C15H16O2
- Molecular weight: 228.2863
- IUPAC Standard InChIKey: IISBACLAFKSPIT-UHFFFAOYSA-N
- CAS Registry Number: 80-05-7
- Chemical structure:
View 3d structure (requires JavaScript / HTML 5) - Other names: Phenol, 4,4'-isopropylidenedi-; p,p'-Isopropylidenebisphenol; p,p'-Isopropylidenediphenol; Biphenol A; Bisphenol A; Dian; Diano; Diphenylolpropane; Parabis A; Phenol, (1-methylethylidene)bis-; Pluracol 245; 2,2-Bis(hydroxyphenyl)propane; 2,2-Bis(p-hydroxyphenyl)propane; 2,2-Bis(4-hydroxyphenyl)propane; 4,4'-Isopropylidenebis[phenol]; 4,4'-Isopropylidenediphenol; Bis(4-hydroxyphenyl) dimethylmethane; p,p'-Dihydroxydiphenyldimethylmethane; 4,4'-Dihydroxydiphenyldimethylmethane; p,p'-Dihydroxydiphenylpropane; 4,4'-Dihydroxydiphenylpropane; 2,2-(4,4'-Dihydroxydiphenyl)propane; 4,4'-Dihydroxy-2,2-diphenylpropane; 4,4'-Dihydroxydiphenyl-2,2-propane; β-di-p-hydroxyphenylpropane; 2,2-Di(4-hydroxyphenyl)propane; Dimethyl bis(p-hydroxyphenyl)methane; Dimethylmethylene-p,p'-diphenol; 2,2-Di(4-phenylol)propane; di-2,2-(4-Hydroxyphenyl)propane; 2,2-di-(4'-Hydroxyphenyl)-propane; β,β'-Bis(p-hydroxyphenyl)propane; p,p'-Bisphenol A; Bis(p-hydroxyphenyl)propane; Bisferol A; Bisphenol; Isopropylidenebis(4-hydroxybenzene); NCI-C50635; Phenol, 4,4'-dimethylmethylenedi-; Propane, 2,2-bis(p-hydroxyphenyl)-; 2,2-Bis-4'-hydroxyfenylpropan; 4,4'-(1-Methylethylidene)bisphenol; 4,4'-Bisphenol A; 4,4-Isopropylidenediphenol; Ipognox 88; Rikabanol; 2,2-(4,4-Dihydroxydiphenyl)propane; 2,2-Bis (4-hydroxyphenol) propane; 2,2-Bis(4,4'-hydroxyphenyl)propane; 4,4'-Dihydroxdiphenylpropane; Parabis; 2,2-Bis(4'-hydroxyphenyl)propane; BPA 157; 4,4-(1-Methylethylidene)-bis-phenol

Condensed phase thermochemistry data

Data compiled as indicated in comments:
ALS - Hussein Y. Afeefy, Joel F. Liebman, and Stephen E. Stein
DH - Eugene S. Domalski and Elizabeth D. Hearing
Quantity | Value | Units | Method | Reference | Comment |
---|---|---|---|---|---|
ΔfH°solid | -349.4 ± 1.7 | kJ/mol | Ccb | Larina and Novoselova, 1982 | ALS |
ΔfH°solid | -368.6 ± 1.8 | kJ/mol | Ccb | Hubbard, Knowlton, et al., 1948 | Reanalyzed by Cox and Pilcher, 1970, Original value = -369. ± 2. kJ/mol; ALS |
Quantity | Value | Units | Method | Reference | Comment |
ΔcH°solid | -7840.0 ± 1.7 | kJ/mol | Ccb | Larina and Novoselova, 1982 | Corresponding ΔfHºsolid = -349.3 kJ/mol (simple calculation by NIST; no Washburn corrections); ALS |
ΔcH°solid | -7820.7 ± 1.7 | kJ/mol | Ccb | Hubbard, Knowlton, et al., 1948 | Reanalyzed by Cox and Pilcher, 1970, Original value = -7820. ± 2. kJ/mol; Corresponding ΔfHºsolid = -368.6 kJ/mol (simple calculation by NIST; no Washburn corrections); ALS |
Quantity | Value | Units | Method | Reference | Comment |
S°solid,1 bar | 287.7 | J/mol*K | N/A | Novoselova, Tsvetkova, et al., 1985 | DH |
Constant pressure heat capacity of solid
Cp,solid (J/mol*K) | Temperature (K) | Reference | Comment |
---|---|---|---|
287.72 | 298.15 | Novoselova, Tsvetkova, et al., 1985 | T = 14 to 480 K.; DH |

Phase change data

Data compiled as indicated in comments:
BS - Robert L. Brown and Stephen E. Stein
TRC - Thermodynamics Research Center, NIST Boulder Laboratories, Chris Muzny director
AC - William E. Acree, Jr., James S. Chickos
DH - Eugene S. Domalski and Elizabeth D. Hearing
Quantity | Value | Units | Method | Reference | Comment |
---|---|---|---|---|---|
Tfus | 431. | K | N/A | Vaiser, Ryabov, et al., 1960 | Uncertainty assigned by TRC = 4. K; TRC |
Quantity | Value | Units | Method | Reference | Comment |
Ttriple | 433. | K | N/A | Novoselova, Tsvetkova, et al., 1985, 2 | Uncertainty assigned by TRC = 1. K; TRC |
Reduced pressure boiling point
Tboil (K) | Pressure (bar) | Reference | Comment |
---|---|---|---|
493.2 | 0.005 | Weast and Grasselli, 1989 | BS |
523. to 525. | 0.017 | Buckingham and Donaghy, 1982 | BS |
Enthalpy of vaporization
ΔvapH (kJ/mol) | Temperature (K) | Method | Reference | Comment |
---|---|---|---|---|
102.2 | 481. | A | Stephenson and Malanowski, 1987 | Based on data from 466. to 634. K. See also Stull, 1947.; AC |
Antoine Equation Parameters
log10(P) = A − (B / (T + C))
P = vapor pressure (bar)
T = temperature (K)
View plot Requires a JavaScript / HTML 5 canvas capable browser.
Temperature (K) | A | B | C | Reference | Comment |
---|---|---|---|---|---|
466. to 633.7 | 7.59699 | 4619.198 | -25.179 | Stull, 1947 | Coefficents calculated by NIST from author's data. |
Enthalpy of fusion
ΔfusH (kJ/mol) | Temperature (K) | Reference | Comment |
---|---|---|---|
30.100 | 433. | Novoselova, Tsvetkova, et al., 1985 | DH |
30.1 | 433. | Domalski and Hearing, 1996 | AC |
Entropy of fusion
ΔfusS (J/mol*K) | Temperature (K) | Reference | Comment |
---|---|---|---|
69.6 | 433. | Novoselova, Tsvetkova, et al., 1985 | DH |

Van Den Dool and Kratz RI, non-polar column, custom temperature program

Column type | Active phase | I | Reference | Comment |
---|---|---|---|---|
Capillary | OV-101 | 2108. | Yasuhara, Shiraishi, et al., 1997 | 15. m/0.25 mm/0.25 μm, He; Program: 50C(2min) => (20C/min) => 120C => (7C/min) => 310C(10min) |

Normal alkane RI, non-polar column, temperature ramp

Column type | Active phase | I | Reference | Comment |
---|---|---|---|---|
Capillary | HP-5 MS | 2108. | Xu, Han, et al., 2012 | 30. m/0.25 mm/0.25 μm, 60. C @ 2. min, 15. K/min, 300. C @ 10. min |
Capillary | HP-5 MS | 2108. | Xu, Han, et al., 2009 | 30. m/0.25 mm/0.25 μm, Helium, 60. C @ 2. min, 15. K/min, 300. C @ 10. min |

Lee's RI, non-polar column, custom temperature program

Column type | Active phase | I | Reference | Comment |
---|---|---|---|---|
Capillary | Methyl Silicone | 359.41 | Eckel, Ross, et al., 1993 | Program: not specified |

References

Larina and Novoselova, 1982
Larina, V.N.; Novoselova, N.V.,
Heat of combustion of polycarbonate and 2,2-bis(4-hydroxyphenyl)propane,
Termodin. Organ. Soedin., 1982, 110-112. [all data]
Hubbard, Knowlton, et al., 1948
Hubbard, W.N.; Knowlton, J.W.; Huffman, H.M.,
The heat of combusion of 2,2'-bis-(4-hydroxyphenyl)-propane,
J. Am. Chem. Soc., 1948, 70, 3259-3261. [all data]
Cox and Pilcher, 1970
Cox, J.D.; Pilcher, G.,
Thermochemistry of Organic and Organometallic Compounds, Academic Press, New York, 1970, 1-636. [all data]
Novoselova, Tsvetkova, et al., 1985
Novoselova, N.V.; Tsvetkova, L.Ya.; Rabinovich, I.B.; Moseeva, E.M.; Faminskaya, L.A.,
Specific heat and thermodynamic functions of 4,4'-dihydroxydiphenyl-2,2-propane, 4,4'-dichlorodiphenylsulphone, and polysulphone,
Zhur. Fiz. Khim., 1985, 59, 604-608. [all data]
Vaiser, Ryabov, et al., 1960
Vaiser, V.L.; Ryabov, V.D.; Piryatinskii, B.M.,
Preparation of Vinylphenol by Catalystic Cracking of Certain Dihydrodiaryl- alkanes,
Dokl. Akad. Nauk SSSR, 1960, 132, 349. [all data]
Novoselova, Tsvetkova, et al., 1985, 2
Novoselova, N.V.; Tsvetkova, L.Ya.; Rabinovich, I.B.; Moseeva, E.M.; Faminskaya, L.A.,
Heat Capacity and Thermodynamic Functions of 4,4'-Dihydroxydiphenyl- 2,2-propane, 4,4'-Dichlorodiphenyl sulfone and Polysulfone,
Zh. Fiz. Khim., 1985, 59, 604. [all data]
Weast and Grasselli, 1989
CRC Handbook of Data on Organic Compounds, 2nd Editon, Weast,R.C and Grasselli, J.G., ed(s)., CRC Press, Inc., Boca Raton, FL, 1989, 1. [all data]
Buckingham and Donaghy, 1982
Buckingham, J.; Donaghy, S.M.,
Dictionary of Organic Compounds: Fifth Edition, Chapman and Hall, New York, 1982, 1. [all data]
Stephenson and Malanowski, 1987
Stephenson, Richard M.; Malanowski, Stanislaw,
Handbook of the Thermodynamics of Organic Compounds, 1987, https://doi.org/10.1007/978-94-009-3173-2
. [all data]
Stull, 1947
Stull, Daniel R.,
Vapor Pressure of Pure Substances. Organic and Inorganic Compounds,
Ind. Eng. Chem., 1947, 39, 4, 517-540, https://doi.org/10.1021/ie50448a022
. [all data]
Domalski and Hearing, 1996
Domalski, Eugene S.; Hearing, Elizabeth D.,
Heat Capacities and Entropies of Organic Compounds in the Condensed Phase. Volume III,
J. Phys. Chem. Ref. Data, 1996, 25, 1, 1, https://doi.org/10.1063/1.555985
. [all data]
Yasuhara, Shiraishi, et al., 1997
Yasuhara, A.; Shiraishi, H.; Nishikawa, M.; Yamamoto, T.; Uehiro, T.; Nakasugi, O.; Okumura, T.; Kenmotsu, K.; Fukui, H.; Nagase, M.; Ono, Y.; Kawagoshi, Y.; Baba, K.; Noma, Y.,
Determination of organic components in leachates from hazardous waste disposal sites in Japan by gas chromatography-mass spectrometry,
J. Chromatogr. A, 1997, 774, 1-2, 321-332, https://doi.org/10.1016/S0021-9673(97)00078-2
. [all data]
Xu, Han, et al., 2012
Xu, L.-L.; Han, T.; Wu, J.-Z.; Zhang, Q.-Y.; Zhang, H.; Huang, B.-K.; Rahman, K.,
Comparative research of chemical constituents, antifungal and antitumor properties of ether extracts of Panax ginseng and its endophytic fungus, 2012, retrieved from http://www.thefreelibrary.com/Comparative .... [all data]
Xu, Han, et al., 2009
Xu, L.-L.; Han, T.; Wu, J.-Z.; Zhang, Q.-Y.; Zhang, H.; Huang, B.-K.; Rahman, K.,
Comparative research of chemical constituents, antifungal and antitumor properties of ether extracts of Panax ginseng and its endophytic fungus,
Phytomedicine: Int. J. Phytotherapy Phytopharmacology, 2009, 16, 6-7, 609-616, https://doi.org/10.1016/j.phymed.2009.03.014
. [all data]
Eckel, Ross, et al., 1993
Eckel, W.P.; Ross, B.; Isensee, R.K.,
Pentobarbital found in ground water,
Ground Water, 1993, 31, 5, 801-804, https://doi.org/10.1111/j.1745-6584.1993.tb00853.x
. [all data]