Cyclohexyl-3,4-dichlorobenzene

Phase change data

Data compiled by: William E. Acree, Jr., James S. Chickos

Enthalpy of vaporization

ΔvapH (kJ/mol) Temperature (K) Reference Comment
64.7398.Guseinova, Kas'yanov, et al., 1981Based on data from 383. - 488. K.

References

Guseinova, Kas'yanov, et al., 1981
Guseinova, S.N.; Kas'yanov, V.V.; Politanskii, Y.V., Khim. Prom-st. Ser. Khlornaya Prom-st., 1981, 28. [all data]