3-Octyloxybenzoic acid

Phase change data

Data compiled by: William E. Acree, Jr., James S. Chickos

Enthalpy of fusion

ΔfusH (kJ/mol) Temperature (K) Reference
33.12347.1Lai, Lee, et al., 2001

References

Lai, Lee, et al., 2001
Lai, Long-Li; Lee, Long-Je; Wang, Eshin; Su, Feng-Ya, Study of the mesogenic behaviour of hydrogen-bonded complexes prepared from aminophenylazopyridines and benzoic acid derivatives, Liquid Crystals, 2001, 28, 3, 381-386, https://doi.org/10.1080/02678290010013957 . [all data]