α-Irone

Normal alkane RI, non-polar column, temperature ramp

Data compiled by: NIST Mass Spectrometry Data Center, William E. Wallace, director

Column type CapillaryCapillaryCapillary
Active phase DB-5HP-5DB-1
Column length (m) 30.25.30.
Carrier gas HeliumHeHe
Substrate
Column diameter (mm) 0.250.20.2
Phase thickness (μm) 0.250.33
Tstart (C) 60.60.60.
Tend (C) 240.240.240.
Heat rate (K/min) 3.3.3.
Initial hold (min)
Final hold (min)  7.
I 1517.1518.1519.0
ReferenceMagalhaes, Lima, et al., 2010Duarte, Figueira, et al., 2005Santos, Moreira, et al., 2001
Comment MSDC-RI MSDC-RI MSDC-RI

References

Magalhaes, Lima, et al., 2010
Magalhaes, L.A.M.; Lima, M. daP.; Marques, M.O.M.; Facanali, R.; Pinto, A.C. daS.; Tadei, W.P., Chemical composition and larvicidal activity against Aedes aegypti Larvae of essential oils from four Guarea species, Molecules, 2010, 15, 8, 5734-5741, https://doi.org/10.3390/molecules15085734 . [all data]

Duarte, Figueira, et al., 2005
Duarte, M.C.T.; Figueira, G.M.; Sartoratto, A.; Rehder, V.L.G.; Delarmelina, C., Anti-Candida activity of Brazilian medicinal plants, J. Ethnopharmacol., 2005, 97, 2, 305-311, https://doi.org/10.1016/j.jep.2004.11.016 . [all data]

Santos, Moreira, et al., 2001
Santos, P.R.; Moreira, D.L.; Guimaraes, E.F.; Kaplan, M.A.C., Essential oil analysis of 10 piperaceae species from the Brazilian Atlantic forest, Phytochemistry, 2001, 58, 4, 547-551, https://doi.org/10.1016/S0031-9422(01)00290-4 . [all data]