Lanosterol
- Formula: C30H50O
- Molecular weight: 426.7174
- IUPAC Standard InChIKey: CAHGCLMLTWQZNJ-HGYRDELPSA-N
- CAS Registry Number: 79-63-0
- Chemical structure:
View 3d structure (requires JavaScript / HTML 5) - Other names: Lanosta-8,24-dien-3-ol, (3β)-; Lanosta-8,24-dien-3β-ol; Botalan base 138; Cholesta-8,24-dien-3-ol, 4,4,14-trimethyl-, (3β,5α)-; Lanosta-8,24-dienol; Lanosterin; Lanster; (3β)-Lanosta-8,24-dien-3-ol; NSC 60677

Kovats' RI, non-polar column, isothermal

Column type | Active phase | Temperature (C) | I | Reference | Comment |
---|---|---|---|---|---|
Capillary | Methyl Silicone | 250. | 3300. | Shlyakhov, 1984 |

References

Shlyakhov, 1984
Shlyakhov, A.F.,
Gas chromatography in organic geochemistry, Nedra, Moscow, 1984, 221. [all data]