Acetic acid, dichloro-
- Formula: C2H2Cl2O2
- Molecular weight: 128.942
- IUPAC Standard InChIKey: JXTHNDFMNIQAHM-UHFFFAOYSA-N
- CAS Registry Number: 79-43-6
- Chemical structure:
View 3d structure (requires JavaScript / HTML 5) - Other names: Dichloracetic acid; Dichlorethanoic acid; Dichloroacetic acid; Dichloroethanoic acid; Urner's liquid; 2,2-Dichloroacetic acid; Bichloracetic acid; DCA; Kyselina dichloroctova; UN 1764; Acetic acid, 2,2-dichloro-; DCA (acid); NSC 2654

Condensed phase thermochemistry data

Data compiled as indicated in comments:
ALS - Hussein Y. Afeefy, Joel F. Liebman, and Stephen E. Stein
DH - Eugene S. Domalski and Elizabeth D. Hearing
Quantity | Value | Units | Method | Reference | Comment |
---|---|---|---|---|---|
ΔcH°liquid | -624. ± 4. | kJ/mol | Ccb | Smith, Bjellerup, et al., 1953 | ALS |
ΔcH°liquid | -619.7 | kJ/mol | Ccb | Schjanberg, 1935 | ALS |
Constant pressure heat capacity of liquid
Cp,liquid (J/mol*K) | Temperature (K) | Reference | Comment |
---|---|---|---|
207. | 291. to 323. | Pickering, 1895 | T = 253 to 323 K.; DH |
Constant pressure heat capacity of solid
Cp,solid (J/mol*K) | Temperature (K) | Reference | Comment |
---|---|---|---|
182.30 | 280.31 | Glasgow and Timmerman, 1961 | T = -180 to 7°C. Value is unsmoothed experimental datum.; DH |

Phase change data

Data compiled as indicated in comments:
BS - Robert L. Brown and Stephen E. Stein
TRC - Thermodynamics Research Center, NIST Boulder Laboratories, Chris Muzny director
AC - William E. Acree, Jr., James S. Chickos
DH - Eugene S. Domalski and Elizabeth D. Hearing
Quantity | Value | Units | Method | Reference | Comment |
---|---|---|---|---|---|
Tboil | 467.2 | K | N/A | Weast and Grasselli, 1989 | BS |
Quantity | Value | Units | Method | Reference | Comment |
Tfus | 284. | K | N/A | Timmermans, 1935 | Uncertainty assigned by TRC = 1.5 K; TRC |
Tfus | 283.95 | K | N/A | Pickering, 1895 | Uncertainty assigned by TRC = 0.1 K; TRC |
Quantity | Value | Units | Method | Reference | Comment |
Ttriple | 286.5 | K | N/A | Glasgow and Timmermans, 1961 | Uncertainty assigned by TRC = 0.2 K; adiabatic calorimeter; TRC |
Enthalpy of vaporization
ΔvapH (kJ/mol) | Temperature (K) | Method | Reference | Comment |
---|---|---|---|---|
55.7 | 332. | A | Stephenson and Malanowski, 1987 | Based on data from 317. to 468. K. See also Stull, 1947.; AC |
Antoine Equation Parameters
log10(P) = A − (B / (T + C))
P = vapor pressure (bar)
T = temperature (K)
View plot Requires a JavaScript / HTML 5 canvas capable browser.
Temperature (K) | A | B | C | Reference | Comment |
---|---|---|---|---|---|
317. to 467.6 | 5.40504 | 2339.536 | -34.489 | Stull, 1947 | Coefficents calculated by NIST from author's data. |
Enthalpy of fusion
ΔfusH (kJ/mol) | Temperature (K) | Reference | Comment |
---|---|---|---|
12.340 | 286.5 | Glasgow and Timmerman, 1961 | DH |
12.34 | 286.5 | Domalski and Hearing, 1996 | AC |
7.644 | 283.95 | Pickering, 1895 | DH |
Entropy of fusion
ΔfusS (J/mol*K) | Temperature (K) | Reference | Comment |
---|---|---|---|
43.1 | 286.5 | Glasgow and Timmerman, 1961 | DH |
26.9 | 283.95 | Pickering, 1895 | DH |

Reaction thermochemistry data

Data compiled as indicated in comments:
B - John E. Bartmess
ALS - Hussein Y. Afeefy, Joel F. Liebman, and Stephen E. Stein
Individual Reactions
C2HCl2O2- + =
By formula: C2HCl2O2- + H+ = C2H2Cl2O2
Quantity | Value | Units | Method | Reference | Comment |
---|---|---|---|---|---|
ΔrH° | 1374. ± 8.8 | kJ/mol | G+TS | Caldwell, Renneboog, et al., 1989 | gas phase; B |
ΔrH° | 1374. ± 11. | kJ/mol | G+TS | Cumming and Kebarle, 1978 | gas phase; B |
ΔrH° | 1369. ± 8.8 | kJ/mol | G+TS | Fujio, McIver, et al., 1981 | gas phase; value altered from reference due to change in acidity scale; B |
Quantity | Value | Units | Method | Reference | Comment |
ΔrG° | 1347. ± 8.4 | kJ/mol | IMRE | Caldwell, Renneboog, et al., 1989 | gas phase; B |
ΔrG° | 1347. ± 8.4 | kJ/mol | IMRE | Cumming and Kebarle, 1978 | gas phase; B |
ΔrG° | 1342. ± 8.4 | kJ/mol | IMRE | Fujio, McIver, et al., 1981 | gas phase; value altered from reference due to change in acidity scale; B |
By formula: H2O + C2HCl3O = HCl + C2H2Cl2O2
Quantity | Value | Units | Method | Reference | Comment |
---|---|---|---|---|---|
ΔrH° | -107.7 | kJ/mol | Cm | Pritchard and Skinner, 1950 | liquid phase; Heat of hydrolysis at 298 K; ALS |

Gas phase ion energetics data

Data compiled by: John E. Bartmess
De-protonation reactions
C2HCl2O2- + =
By formula: C2HCl2O2- + H+ = C2H2Cl2O2
Quantity | Value | Units | Method | Reference | Comment |
---|---|---|---|---|---|
ΔrH° | 1374. ± 8.8 | kJ/mol | G+TS | Caldwell, Renneboog, et al., 1989 | gas phase |
ΔrH° | 1374. ± 11. | kJ/mol | G+TS | Cumming and Kebarle, 1978 | gas phase |
ΔrH° | 1369. ± 8.8 | kJ/mol | G+TS | Fujio, McIver, et al., 1981 | gas phase; value altered from reference due to change in acidity scale |
Quantity | Value | Units | Method | Reference | Comment |
ΔrG° | 1347. ± 8.4 | kJ/mol | IMRE | Caldwell, Renneboog, et al., 1989 | gas phase |
ΔrG° | 1347. ± 8.4 | kJ/mol | IMRE | Cumming and Kebarle, 1978 | gas phase |
ΔrG° | 1342. ± 8.4 | kJ/mol | IMRE | Fujio, McIver, et al., 1981 | gas phase; value altered from reference due to change in acidity scale |

References

Smith, Bjellerup, et al., 1953
Smith, L.; Bjellerup, L.; Krook, S.; Westermark, H.,
Heats of combustion of organic chloro compounds determined by the "quartz wool" method,
Acta Chem. Scand., 1953, 7, 65. [all data]
Schjanberg, 1935
Schjanberg, E.,
Die Verbrennungswarmen und die Refraktionsdaten einiger chlorsubstituierter Fettsauren und Ester.,
Z. Phys. Chem. Abt. A, 1935, 172, 197-233. [all data]
Pickering, 1895
Pickering, S.U.,
A comparison of some properties of acetic acid and its chloro- and bromo-derivatives,
J. Chem. Soc., 1895, 67, 664-684. [all data]
Glasgow and Timmerman, 1961
Glasgow, A.R.; Timmerman, J.,
Some physical properties of monochloro-, dichloro-, and monobromoacetic acids at 1 atmosphere,
Bull. Soc. Chim. Belg., 1961, 70, 599-622. [all data]
Weast and Grasselli, 1989
CRC Handbook of Data on Organic Compounds, 2nd Editon, Weast,R.C and Grasselli, J.G., ed(s)., CRC Press, Inc., Boca Raton, FL, 1989, 1. [all data]
Timmermans, 1935
Timmermans, J.,
Researches in Stoichiometry. I. The Heat of Fusion of Organic Compounds.,
Bull. Soc. Chim. Belg., 1935, 44, 17-40. [all data]
Glasgow and Timmermans, 1961
Glasgow, A.R.; Timmermans, J.,
Some physical properties of monochloro-, dichloro-, and monobromoacetic acids at 1 atmosphere,
Bull. Soc. Chim. Belg., 1961, 70, 5599-622. [all data]
Stephenson and Malanowski, 1987
Stephenson, Richard M.; Malanowski, Stanislaw,
Handbook of the Thermodynamics of Organic Compounds, 1987, https://doi.org/10.1007/978-94-009-3173-2
. [all data]
Stull, 1947
Stull, Daniel R.,
Vapor Pressure of Pure Substances. Organic and Inorganic Compounds,
Ind. Eng. Chem., 1947, 39, 4, 517-540, https://doi.org/10.1021/ie50448a022
. [all data]
Domalski and Hearing, 1996
Domalski, Eugene S.; Hearing, Elizabeth D.,
Heat Capacities and Entropies of Organic Compounds in the Condensed Phase. Volume III,
J. Phys. Chem. Ref. Data, 1996, 25, 1, 1, https://doi.org/10.1063/1.555985
. [all data]
Caldwell, Renneboog, et al., 1989
Caldwell, G.; Renneboog, R.; Kebarle, P.,
Gas Phase Acidities of Aliphatic Carboxylic Acids, Based on Measurements of Proton Transfer Equilibria,
Can. J. Chem., 1989, 67, 4, 661, https://doi.org/10.1139/v89-092
. [all data]
Cumming and Kebarle, 1978
Cumming, J.B.; Kebarle, P.,
Summary of gas phase measurements involving acids AH. Entropy changes in proton transfer reactions involving negative ions. Bond dissociation energies D(A-H) and electron affinities EA(A),
Can. J. Chem., 1978, 56, 1. [all data]
Fujio, McIver, et al., 1981
Fujio, M.; McIver, R.T., Jr.; Taft, R.W.,
Effects on the acidities of phenols from specific substituent-solvent interactions. Inherent substituent parameters from gas phase acidities,
J. Am. Chem. Soc., 1981, 103, 4017. [all data]
Pritchard and Skinner, 1950
Pritchard, H.O.; Skinner, H.A.,
The heats of hydrolysis of the chloro-substituted acetyl chlorides,
J. Chem. Soc., 1950, 272-276. [all data]