Propionic acid, 2-chloro-, isopropyl ester
- Formula: C6H11ClO2
- Molecular weight: 150.603
- IUPAC Standard InChIKey: BOKVSRHWZPCJRN-UHFFFAOYSA-N
- CAS Registry Number: 79435-04-4
- Chemical structure:
View 3d structure (requires JavaScript / HTML 5) - Species with the same structure:

Condensed phase thermochemistry data

Data compiled by: Hussein Y. Afeefy, Joel F. Liebman, and Stephen E. Stein
Quantity | Value | Units | Method | Reference | Comment |
---|---|---|---|---|---|
ΔcH°liquid | -3364. | kJ/mol | Ccb | Schjanberg, 1935 |

References

Schjanberg, 1935
Schjanberg, E.,
Die Verbrennungswarmen und die Refraktionsdaten einiger chlorsubstituierter Fettsauren und Ester.,
Z. Phys. Chem. Abt. A, 1935, 172, 197-233. [all data]