Ethanedithioamide
- Formula: C2H4N2S2
- Molecular weight: 120.197
- IUPAC Standard InChIKey: OAEGRYMCJYIXQT-UHFFFAOYSA-N
- CAS Registry Number: 79-40-3
- Chemical structure:
View 3d structure (requires JavaScript / HTML 5) - Other names: Oxamide, dithio-; Dithiooxamide; Hydrorubeanic acid; Rubean; Rubeane; Rubeanic acid; Dithioxamide; Oxaldiimidic acid, dithio-; RVK; USAF EK-4394; USAF MK-6; USAF B-43; Dithiooxalic acid diamide; NSC 1893

Condensed phase thermochemistry data

Data compiled by: Hussein Y. Afeefy, Joel F. Liebman, and Stephen E. Stein
Quantity | Value | Units | Method | Reference | Comment |
---|---|---|---|---|---|
ΔfH°solid | -20.8 ± 1.0 | kJ/mol | Ccr | Nunez, Barral, et al., 1988 | |
Quantity | Value | Units | Method | Reference | Comment |
ΔcH°solid | -2541.9 ± 0.5 | kJ/mol | Ccr | Nunez, Barral, et al., 1988 |

Phase change data

Data compiled by: Hussein Y. Afeefy, Joel F. Liebman, and Stephen E. Stein
Quantity | Value | Units | Method | Reference | Comment |
---|---|---|---|---|---|
ΔsubH° | 105.44 | kJ/mol | V | Bradley and Cleasby, 1953 |

Gas phase thermochemistry data

Data compiled by: Hussein Y. Afeefy, Joel F. Liebman, and Stephen E. Stein
Quantity | Value | Units | Method | Reference | Comment |
---|---|---|---|---|---|
ΔfH°gas | 83.0 ± 1.5 | kJ/mol | Ccr | Nunez, Barral, et al., 1988 |

References

Nunez, Barral, et al., 1988
Nunez, L.; Barral, L.; Pilcher, G.,
Enthalpies of combustion of oxamic acid, oxamide, and dithiooxamide,
J. Chem. Thermodyn., 1988, 20, 1211-1216. [all data]