Ethene, 1,1-dichloro-2,2-difluoro-
- Formula: C2Cl2F2
- Molecular weight: 132.924
- IUPAC Standard InChIKey: QDGONURINHVBEW-UHFFFAOYSA-N
- CAS Registry Number: 79-35-6
- Chemical structure:
- Other names: Ethylene, 1,1-dichloro-2,2-difluoro-; Genetron 1112a; 1,1-Dichloro-2,2-difluoroethene; 1,1-Dichloro-2,2-difluoroethylene; 1,1-Dichlorodifluoroethylene; 1,1-Difluoro-2,2-dichloroethylene; CF2=CCl2; Genetrone 1112a; CFC 1112a; F 1112a; R 1112a; Ethylene, 1,2-dichloro-1,2-difluoro-

Reaction thermochemistry data

Data compiled by: Hussein Y. Afeefy, Joel F. Liebman, and Stephen E. Stein
Individual Reactions
By formula: CH4O + C2Cl2F2 = C3H4Cl2F2O
Quantity | Value | Units | Method | Reference | Comment |
---|---|---|---|---|---|
ΔrH° | -159. ± 2. | kJ/mol | Cm | Kennedy, Lacher, et al., 1969 | gas phase |
ΔrH° | -156. | kJ/mol | Cm | Hine and Rogers, 1968 | gas phase |
By formula: Cl2 + C2Cl2F2 = C2Cl4F2
Quantity | Value | Units | Method | Reference | Comment |
---|---|---|---|---|---|
ΔrH° | -171.9 ± 2.3 | kJ/mol | Cm | Lacher, McKinley, et al., 1949 | gas phase; Heat of chlorination at 363 °K |
By formula: 3H2 + C2Cl2F2 = C2H4F2 + 2HCl
Quantity | Value | Units | Method | Reference | Comment |
---|---|---|---|---|---|
ΔrH° | -348.7 | kJ/mol | Chyd | Lacher, Kianpour, et al., 1956 | gas phase; At 410 K |
By formula: H2 + C2Cl2F2 = C2HClF2 + HCl
Quantity | Value | Units | Method | Reference | Comment |
---|---|---|---|---|---|
ΔrH° | -90.21 | kJ/mol | Chyd | Lacher, Kianpour, et al., 1956 | gas phase; At 298 K |
+
= C5H8Cl2F2O
By formula: C3H8O + C2Cl2F2 = C5H8Cl2F2O
Quantity | Value | Units | Method | Reference | Comment |
---|---|---|---|---|---|
ΔrH° | -183. ± 1. | kJ/mol | Eqk | Kennedy, Lacher, et al., 1969 | gas phase |
+
= C4H6Cl2F2O
By formula: C2H6O + C2Cl2F2 = C4H6Cl2F2O
Quantity | Value | Units | Method | Reference | Comment |
---|---|---|---|---|---|
ΔrH° | -164. ± 3. | kJ/mol | Cm | Kennedy, Lacher, et al., 1969 | gas phase |
+
= C5H8Cl2F2O
By formula: C3H8O + C2Cl2F2 = C5H8Cl2F2O
Quantity | Value | Units | Method | Reference | Comment |
---|---|---|---|---|---|
ΔrH° | -164. ± 2. | kJ/mol | Cm | Kennedy, Lacher, et al., 1969 | gas phase |

Normal alkane RI, non-polar column, custom temperature program

Column type | Active phase | I | Reference | Comment |
---|---|---|---|---|
Capillary | Porapack Q | 428. | Zenkevich and Rodin, 2004 | Program: not specified |
Capillary | Methyl Silicone | 454. | Zenkevich, 1999 | Program: not specified |
Capillary | Polydimethyl siloxanes | 454. | Zenkevich, 1997 | Program: not specified |

Phase change data

Data compiled by: Robert L. Brown and Stephen E. Stein
Quantity | Value | Units | Method | Reference | Comment |
---|---|---|---|---|---|
Tboil | 292. | K | N/A | PCR Inc., 1990 |

Gas phase ion energetics data

Data evaluated as indicated in comments:
L - Sharon G. Lias
Data compiled as indicated in comments:
LLK - Sharon G. Lias, Rhoda D. Levin, and Sherif A. Kafafi
RDSH - Henry M. Rosenstock, Keith Draxl, Bruce W. Steiner, and John T. Herron
Quantity | Value | Units | Method | Reference | Comment |
---|---|---|---|---|---|
IE (evaluated) | 9.65 ± 0.03 | eV | N/A | N/A | L |
Ionization energy determinations
IE (eV) | Method | Reference | Comment |
---|---|---|---|
9.62 | PE | Cullen, Frost, et al., 1972 | LLK |
9.69 ± 0.01 | S | Scott and Russell, 1971 | LLK |
9.65 | PE | Lake and Thompson, 1970 | RDSH |
9.82 ± 0.02 | EI | Bunzli, Frost, et al., 1976 | Vertical value; LLK |

Vibrational and/or electronic energy levels

Data compiled by: Takehiko Shimanouchi

Symmetry:   C     Symmetry Number σ = 2

 Sym.   No   Approximate   Selected Freq.  Infrared   Raman   Comments
 Species   type of mode   Value   Rating   Value  Phase  Value  Phase

a1 1 CC str 1749  B 1749 VS gas 1738.8 S liq.
a1 2 CF str 1032  B 1032 VS gas 1027.6 M liq.
a1 3 CCl str 622  C 622 M gas 623.0 S liq.
a1 4 CF2 scis 434  C 434 gas 433.8 VS liq.
a1 5 CCl2 scis 258  C 258 S gas 258 VS liq.
a2 6 Torsion 167  D 167 VW liq.
b1 7 CF str 1327  B 1327 VS gas 1313 VW liq.
b1 8 CCl str 989  B 989 VS gas 986 VW liq.
b1 9 CF2 rock 459  C 459 VW gas 454 W liq.
b1 10 CCl2 rock 192  C 192 gas 187.8 W liq.
b2 11 CF2 wag 564  C 564 S gas 560.8 VS liq.
b2 12 CCl2 wag 323  C 323 W gas

Source: Shimanouchi, 1972

References

Kennedy, Lacher, et al., 1969
Kennedy, M.B.; Lacher, J.R.; Park, J.D.,
Reaction heats of organic compounds. VI. Heats of addition of some alcohols to 1,1-dichloro-2,2-difluoroethylene,
Trans. Faraday Soc., 1969, 65, 1435-1442. [all data]
Hine and Rogers, 1968
Hine, J.; Rogers, F.E.,
Stabilizing interactions between substituents attached to the same saturated carbon atom. Enthalpies of addition of methanol, pyrrolidine, and 1-butanethiol to 1,1-dichloro-2,2-difluoroethylene,
J. Am. Chem. Soc., 1968, 90, 6701-6. [all data]
Lacher, McKinley, et al., 1949
Lacher, J.R.; McKinley, J.J.; Walden, C.; Lea, K.; Park, J.D.,
Reaction heats of organic fluorine compounds. II. The vapor phase heats of chlorination of some simple fluoroolefins,
J. Am. Chem. Soc., 1949, 71, 1334-1337. [all data]
Lacher, Kianpour, et al., 1956
Lacher, J.R.; Kianpour, A.; Oetting, F.; Park, J.D.,
Reaction calorimetry. The hydrogenation of organic fluorides and chlorides,
Trans. Faraday Soc., 1956, 52, 1500-1508. [all data]
Zenkevich and Rodin, 2004
Zenkevich, I.G.; Rodin, A.A.,
Gas chromatographic identification of some volatile toxic fluorine containing compounds by precalculated retention indices,
J. Ecol. Chem. (Rus.), 2004, 13, 1, 22-28. [all data]
Zenkevich, 1999
Zenkevich, I.G.,
New Application of the Retention Index Concept in Gas and High Performance Liquid Chromatography,
Fresenius' J. Anal. Chem., 1999, 365, 4, 305-309, https://doi.org/10.1007/s002160051491
. [all data]
Zenkevich, 1997
Zenkevich, I.G.,
Influence of the Variations of Dynamics Molecular Parameterts on the Additivity of Chromatigraphic Retention Indices of Products of Organic Reactions Relative to Initial Reagents,
Dokl. Akad. Nauk (Rus.), 1997, 353, 5, 625-627. [all data]