L-Lactic acid
- Formula: C3H6O3
- Molecular weight: 90.0779
- IUPAC Standard InChIKey: JVTAAEKCZFNVCJ-UWTATZPHSA-N
- CAS Registry Number: 79-33-4
- Chemical structure:
- Other names: (S)-2-Hydroxypropanoic acid; L-(+)-Lactic acid; Propanoic acid, 2-hydroxy-, (S)-; Lactic acid, L-; Espiritin; (S)-2-Hydroxypropionic acid; (+)-Lactic acid; (S)-Lactic acid; (S)-(+)-Lactic acid; Paralactic acid; Sarcolactic acid; Tisulac; PH 90; Propanoic acid, 2-hydroxy-, (2S)-; PURAC; lactate

Condensed phase thermochemistry data

Data compiled by: Hussein Y. Afeefy, Joel F. Liebman, and Stephen E. Stein
Quantity | Value | Units | Method | Reference | Comment |
---|---|---|---|---|---|
ΔfH°solid | -165.89 | kcal/mol | Ccb | Saville and Gundry, 1959 | |
Quantity | Value | Units | Method | Reference | Comment |
ΔcH°solid | -321.22 ± 0.11 | kcal/mol | Ccb | Saville and Gundry, 1959 | Corresponding ΔfHºsolid = -165.878 kcal/mol (simple calculation by NIST; no Washburn corrections) |

Phase change data

Data compiled by: Robert L. Brown and Stephen E. Stein
Reduced pressure boiling point
Tboil (K) | Pressure (atm) | Reference |
---|---|---|
392.2 | 0.016 | Aldrich Chemical Company Inc., 1990 |

References

Saville and Gundry, 1959
Saville, G.; Gundry, H.A.,
The heats of combustion, solution and ionization of lactic acid,
Trans. Faraday Soc., 1959, 55, 2036-2038. [all data]
Aldrich Chemical Company Inc., 1990
Aldrich Chemical Company Inc.,
Catalog Handbook of Fine Chemicals, Aldrich Chemical Company, Inc., Milwaukee WI, 1990, 1. [all data]