Propanoyl chloride, 2-methyl-
- Formula: C4H7ClO
- Molecular weight: 106.551
- IUPAC Standard InChIKey: DGMOBVGABMBZSB-UHFFFAOYSA-N
- CAS Registry Number: 79-30-1
- Chemical structure:
View 3d structure (requires JavaScript / HTML 5) - Other names: Isobutyric acid chloride; Isobutyroyl chloride; Isobutyryl chloride; 2-Methylpropanoyl chloride; 2-Methylpropionyl chloride; UN 2395; Isobutanoyl chloride

Condensed phase thermochemistry data

Data compiled by: Eugene S. Domalski and Elizabeth D. Hearing
Constant pressure heat capacity of liquid
Cp,liquid (J/mol*K) | Temperature (K) | Reference | Comment |
---|---|---|---|
131.8 | 298. | von Reis, 1881 | T = 293 to 368 K. |

Phase change data

Data compiled as indicated in comments:
BS - Robert L. Brown and Stephen E. Stein
TRC - Thermodynamics Research Center, NIST Boulder Laboratories, Chris Muzny director
Quantity | Value | Units | Method | Reference | Comment |
---|---|---|---|---|---|
Tboil | 365.2 | K | N/A | Weast and Grasselli, 1989 | BS |
Tboil | 363. | K | N/A | Yamase, 1961 | Uncertainty assigned by TRC = 3. K; TRC |
Tboil | 333. | K | N/A | Cason and Chang, 1956 | Uncertainty assigned by TRC = 4. K; TRC |
Tboil | 365. | K | N/A | Percival, Wagner, et al., 1953 | Uncertainty assigned by TRC = 2. K; TRC |
Quantity | Value | Units | Method | Reference | Comment |
Tfus | 183.2 | K | N/A | Timmermans and Mattaar, 1921 | Uncertainty assigned by TRC = 0.7 K; TRC |

Normal alkane RI, non-polar column, temperature ramp

Data compiled by: NIST Mass Spectrometry Data Center, William E. Wallace, director

Column type Capillary
Active phase OV-101
Column length (m) 25.
Carrier gas N2/He
Substrate
Column diameter (mm) 0.20
Phase thickness (μm) 0.10
Tstart (C) 50.
Tend (C) 250.
Heat rate (K/min) 6.
Initial hold (min)
Final hold (min)
I 672.
ReferenceZenkevich, 2005
Comment MSDC-RI

References

von Reis, 1881
von Reis, M.A.,
Die specifische Wärme flüssiger organischer Verbindungen und ihre Beziehung zu deren Moleculargewicht,
Ann. Physik [3], 1881, 13, 447-464. [all data]
Weast and Grasselli, 1989
CRC Handbook of Data on Organic Compounds, 2nd Editon, Weast,R.C and Grasselli, J.G., ed(s)., CRC Press, Inc., Boca Raton, FL, 1989, 1. [all data]
Yamase, 1961
Yamase, Y.,
Friedel-Crafts Acylation II. Relative Reactivity for Some Acyl Halides,
Bull. Chem. Soc. Jpn., 1961, 34, 480-84. [all data]
Cason and Chang, 1956
Cason, J.; Chang, M.P.,
Condensation of Acrylonitrile with Unsymmetrical Ketones,
J. Org. Chem., 1956, 21, 449. [all data]
Percival, Wagner, et al., 1953
Percival, W.C.; Wagner, R.B.; Cook, N.C.,
J. Am. Chem. Soc., 1953, 75, 3731. [all data]
Timmermans and Mattaar, 1921
Timmermans, J.; Mattaar, J.F.,
Freezing points of orgainic substances VI. New experimental determinations.,
Bull. Soc. Chim. Belg., 1921, 30, 213. [all data]