peracetic acid
- Formula: C2H4O3
- Molecular weight: 76.0514
- CAS Registry Number: 79-21-0

Gas phase thermochemistry data

Data compiled by: Glushko Thermocenter, Russian Academy of Sciences, Moscow
Constant pressure heat capacity of gas
Cp,gas (cal/mol*K) | Temperature (K) | Reference | Comment |
---|---|---|---|
15.24 | 200. | Cugley J., 1976 | |
19.70 | 298.15 | ||
19.78 | 300. | ||
23.89 | 400. | ||
27.349 | 500. | ||
33.599 | 750. | ||
37.651 | 1000. |

Phase change data

Data compiled by: William E. Acree, Jr., James S. Chickos
Enthalpy of vaporization
ΔvapH (kcal/mol) | Temperature (K) | Method | Reference | Comment |
---|---|---|---|---|
10.6 | 288. | A | Stephenson and Malanowski, 1987 | Based on data from 273. to 383. K. See also Dykyj, 1970. |

Henry's Law data

Data compiled by: Rolf Sander
Henry's Law constant (water solution)
kH(T) = k°H exp(d(ln(kH))/d(1/T) ((1/T) - 1/(298.15 K)))
k°H = Henry's law constant for solubility in water at 298.15 K (mol/(kg*bar))
d(ln(kH))/d(1/T) = Temperature dependence constant (K)
k°H (mol/(kg*bar)) | d(ln(kH))/d(1/T) (K) | Method | Reference | Comment |
---|---|---|---|---|
830. | 5300. | M | N/A | |
660. | 5900. | M | N/A | This value is a correction of the solubility published by missing citation. |

References

Cugley J., 1976
Cugley J.,
Infrared spectra, force constants and thermodynamic functions of matrix isolated peroxyacetic acid,
Chem. Phys., 1976, 18, 281-292. [all data]
Stephenson and Malanowski, 1987
Stephenson, Richard M.; Malanowski, Stanislaw,
Handbook of the Thermodynamics of Organic Compounds, 1987, https://doi.org/10.1007/978-94-009-3173-2
. [all data]
Dykyj, 1970
Dykyj, J.,
Petrochemica, 1970, 10, 2, 51. [all data]