Acetic acid, methyl ester
- Formula: C3H6O2
- Molecular weight: 74.0785
- IUPAC Standard InChIKey: KXKVLQRXCPHEJC-UHFFFAOYSA-N
- CAS Registry Number: 79-20-9
- Chemical structure:
View 3d structure (requires JavaScript / HTML 5) - Other names: Methyl acetate; Devoton; Tereton; CH3COOCH3; Methyl ethanoate; Acetate de methyle; Methyl acetic ester; Methylacetaat; Methylacetat; Methyle (acetate de); Methylester kiseliny octove; Metile (acetato di); Ethyl ester of monoacetic acid; UN 1231; Methyl ester of acetic acid; NSC 405071

Vibrational and/or electronic energy levels

Data compiled by: Takehiko Shimanouchi
Symmetry: Cs Symmetry Number σ = 1
Sym. | No | Approximate | Selected Freq. | Infrared | Raman | Comments | ||||
---|---|---|---|---|---|---|---|---|---|---|
Species | type of mode | Value | Rating | Value | Phase | Value | Phase | |||
a' | 1 | CH3(O) d-str | 3035 | D | 3035 M | gas | 3028 | liq. | ||
a' | 2 | CH3(C) d-str | 3031 | E | SF(ν2 )of 3OCD3 | |||||
a' | 3 | CH3(O) s-str | 2966 | D | 2966 S | gas | 2954 p | liq. | ||
a' | 4 | CH3(C) s-str | 2964 | E | 2942 p | liq. | SF(ν4 )of 3OCD3 | |||
a' | 5 | C=O str | 1771 | C | 1771 VS | gas | 1738 p | liq. | ||
a' | 6 | CH3(O) d-deform | 1460 | E | 1460 W sh | solid solid | OV(ν20) | |||
a' | 7 | CH3(O) s-deform | 1440 | D | 1440 M | gas | ||||
a' | 8 | CH3(C) d-deform | 1430 | E | SF(ν8 )of 3OCD3 | |||||
a' | 9 | CH3(C) s-deform | 1375 | D | 1375 S | gas | 1372 p | liq. | ||
a' | 10 | C-O str | 1248 | C | 1248 VS | gas | 1254 | liq. | ||
a' | 11 | CH3(O) rock | 1159 | E | 1159 VW | liq. | ||||
a' | 12 | O-CH3 str | 1060 | C | 1060 S | gas | 1044 | liq. | ||
a' | 13 | CH3(C) rock | 980 | C | 980 W | gas | 980 p | liq. | ||
a' | 14 | CC str | 844 | C | 844 M | gas | 844 p | liq. | ||
a' | 15 | C=O ip-bend | 639 | C | 639 M | gas | 640 p | liq. | ||
a' | 16 | CCO deform | 429 | C | 429 M | gas | 433 p | liq. | ||
a | 17 | COC deform | 303 | D | 303 M | gas | 303 p | liq. | ||
a | 18 | CH3(O) d-str | 3005 | D | 3005 M | gas | 3002 | liq. | ||
a | 19 | CH3(C) d-str | 2994 | D | 2994 W | gas | ||||
a | 20 | CH3(O) d-deform | 1460 | E | 1460 W sh | solid solid | 1449 dp | liq. | OV(ν6) | |
a | 21 | CH3(C) d-deform | 1430 | E | 1430 W | gas | ||||
a | 22 | CH3(O) rock | 1187 | D | 1187 W | gas | 1187 | liq. | ||
a | 23 | CH3(C) rock | 1036 | E | 1036 W | sln. | ||||
a | 24 | C=O op-bend | 607 | D | 607 M | gas | 610 dp | liq. | ||
a | 25 | C-O torsion | 187 | D | 187 W | gas | ||||
a | 26 | C-C torsion | 136 | E | 136 VW | liq. | ||||
a | 27 | O-CH3 torsion | 110 | E | 110 VW | liq. | ||||
Source: Shimanouchi, 1972

Gas phase thermochemistry data

Data compiled as indicated in comments:
ALS - Hussein Y. Afeefy, Joel F. Liebman, and Stephen E. Stein
GT - Glushko Thermocenter, Russian Academy of Sciences, Moscow
Quantity | Value | Units | Method | Reference | Comment |
---|---|---|---|---|---|
ΔfH°gas | -98.00 | kcal/mol | Ccr | Hall and Baldt, 1971 | ALS |
Constant pressure heat capacity of gas
Cp,gas (cal/mol*K) | Temperature (K) | Reference | Comment |
---|---|---|---|
13.33 | 100. | Chao J., 1986 | p=1 bar. Recommended Cp(T) values are in close agreement with those calculated by [ Vay P.-M., 1971]. S(T) values calculated by [ Vay P.-M., 1971] are 4.6-4.8 J/mol*K lower than those of [ Chao J., 1986].; GT |
15.12 | 150. | ||
16.74 | 200. | ||
19.49 | 273.15 | ||
20.56 ± 0.029 | 298.15 | ||
20.64 | 300. | ||
25.170 | 400. | ||
29.493 | 500. | ||
33.282 | 600. | ||
36.530 | 700. | ||
39.309 | 800. | ||
41.697 | 900. | ||
43.752 | 1000. | ||
45.523 | 1100. | ||
47.053 | 1200. | ||
48.372 | 1300. | ||
49.517 | 1400. | ||
50.511 | 1500. |
Constant pressure heat capacity of gas
Cp,gas (cal/mol*K) | Temperature (K) | Reference | Comment |
---|---|---|---|
22.13 | 335.0 | Connett J.E., 1976 | GT |
22.82 | 350.0 | ||
23.994 | 375.0 | ||
25.170 | 400.0 | ||
26.286 | 425.0 | ||
27.397 | 450.0 |

Condensed phase thermochemistry data

Data compiled as indicated in comments:
ALS - Hussein Y. Afeefy, Joel F. Liebman, and Stephen E. Stein
DH - Eugene S. Domalski and Elizabeth D. Hearing
Quantity | Value | Units | Method | Reference | Comment |
---|---|---|---|---|---|
ΔfH°liquid | -106.57 | kcal/mol | Ccr | Hall and Baldt, 1971 | ALS |
Quantity | Value | Units | Method | Reference | Comment |
ΔcH°liquid | -378.3 | kcal/mol | Ccb | Seno, Tsuchiya, et al., 1975 | Corresponding ΔfHºliquid = -108.8 kcal/mol (simple calculation by NIST; no Washburn corrections); ALS |
ΔcH°liquid | -380.54 ± 0.16 | kcal/mol | Ccr | Hall and Baldt, 1971 | Corresponding ΔfHºliquid = -106.56 kcal/mol (simple calculation by NIST; no Washburn corrections); ALS |
Constant pressure heat capacity of liquid
Cp,liquid (cal/mol*K) | Temperature (K) | Reference | Comment |
---|---|---|---|
33.51 | 288.58 | Okamoto, Oguni, et al., 1992 | T = 13 to 290 K. Unsmoothed experimental datum.; DH |
33.781 | 298.15 | Pintos, Bravo, et al., 1988 | DH |
33.60 | 298.15 | Costas and Patterson, 1985 | T = 283.15, 298.15, 313.15 K.; DH |
33.595 | 298.15 | Costas and Patterson, 1985, 2 | T = 283.15, 298.15, 313.15 K.; DH |
29.57 | 297. | Hall and Baldt, 1971 | DH |

Phase change data

Data compiled as indicated in comments:
TRC - Thermodynamics Research Center, NIST Boulder Laboratories, Chris Muzny director
BS - Robert L. Brown and Stephen E. Stein
AC - William E. Acree, Jr., James S. Chickos
ALS - Hussein Y. Afeefy, Joel F. Liebman, and Stephen E. Stein
DRB - Donald R. Burgess, Jr.
DH - Eugene S. Domalski and Elizabeth D. Hearing
Quantity | Value | Units | Method | Reference | Comment |
---|---|---|---|---|---|
Tboil | 330.0 ± 0.9 | K | AVG | N/A | Average of 50 out of 55 values; Individual data points |
Quantity | Value | Units | Method | Reference | Comment |
Tfus | 175.15 | K | N/A | Timmermans and Hennaut-Roland, 1955 | Uncertainty assigned by TRC = 0.3 K; TRC |
Tfus | 175.1 | K | N/A | Timmermans, 1911 | Uncertainty assigned by TRC = 0.2 K; TRC |
Quantity | Value | Units | Method | Reference | Comment |
Ttriple | 174.90 | K | N/A | Okamoto, Oguni, et al., 1992, 2 | Crystal phase 1 phase; Uncertainty assigned by TRC = 0.01 K; TRC |
Quantity | Value | Units | Method | Reference | Comment |
Tc | 510. ± 30. | K | AVG | N/A | Average of 10 values; Individual data points |
Quantity | Value | Units | Method | Reference | Comment |
Pc | 46.88 | atm | N/A | Ambrose, Ellender, et al., 1981 | Uncertainty assigned by TRC = 0.0468 atm; Visual; TRC |
Pc | 46.33 | atm | N/A | Young, 1910 | Uncertainty assigned by TRC = 0.8000 atm; TRC |
Pc | 46.329 | atm | N/A | Young and Thomas, 1893 | Uncertainty assigned by TRC = 0.39 atm; TRC |
Pc | 47.54 | atm | N/A | Nadezhdin, 1887 | Uncertainty assigned by TRC = 0.99995 atm; TRC |
Pc | 57.64 | atm | N/A | Sajots, 1879 | Uncertainty assigned by TRC = 6.0000 atm; TRC |
Quantity | Value | Units | Method | Reference | Comment |
ρc | 4.394 | mol/l | N/A | Young and Thomas, 1893 | Uncertainty assigned by TRC = 0.05 mol/l; TRC |
ρc | 4.32 | mol/l | N/A | Nadezhdin, 1887 | Uncertainty assigned by TRC = 0.08 mol/l; TRC |
Quantity | Value | Units | Method | Reference | Comment |
ΔvapH° | 7.9 ± 0.9 | kcal/mol | AVG | N/A | Average of 7 values; Individual data points |
Enthalpy of vaporization
ΔvapH (kcal/mol) | Temperature (K) | Method | Reference | Comment |
---|---|---|---|---|
7.247 | 330.1 | N/A | Majer and Svoboda, 1985 | |
8.15 | 275. | A | Stephenson and Malanowski, 1987 | Based on data from 260. to 351. K.; AC |
7.98 | 289. | A | Stephenson and Malanowski, 1987 | Based on data from 274. to 329. K. See also Polák and Mertl, 1965 and Dykyj, 1970.; AC |
7.60 | 323. | DTA | Meyer, Awe, et al., 1980 | Based on data from 308. to 338. K.; AC |
7.05 ± 0.02 | 343. | C | Svoboda, Uchytilová, et al., 1980 | AC |
7.70 ± 0.02 | 304. | C | Svoboda, Veselý, et al., 1977 | AC |
7.55 ± 0.02 | 313. | C | Svoboda, Veselý, et al., 1977 | AC |
7.29 ± 0.02 | 328. | C | Svoboda, Veselý, et al., 1977 | AC |
7.24 ± 0.02 | 331. | C | Svoboda, Veselý, et al., 1977 | AC |
7.77 | 295. | N/A | Connett, Counsell, et al., 1976 | AC |
7.22 | 330. | N/A | Connett, Counsell, et al., 1976 | AC |
8.25 | 296. | BG | Baldt and Hall, 1971 | Based on data from 273. to 318. K.; AC |
Enthalpy of vaporization
ΔvapH =
A exp(-βTr) (1 − Tr)β
ΔvapH =
Enthalpy of vaporization (at saturation pressure)
(kcal/mol)
Tr = reduced temperature (T / Tc)
View plot Requires a JavaScript / HTML 5 canvas capable browser.
Temperature (K) | A (kcal/mol) | β | Tc (K) | Reference | Comment |
---|---|---|---|---|---|
296. to 343. | 11.59 | 0.2757 | 506.8 | Majer and Svoboda, 1985 |
Antoine Equation Parameters
log10(P) = A − (B / (T + C))
P = vapor pressure (atm)
T = temperature (K)
View plot Requires a JavaScript / HTML 5 canvas capable browser.
Temperature (K) | A | B | C | Reference | Comment |
---|---|---|---|---|---|
274.91 to 328.99 | 4.19793 | 1164.426 | -52.69 | Polák and Mertl, 1965 | Coefficents calculated by NIST from author's data. |
Enthalpy of fusion
ΔfusH (kcal/mol) | Temperature (K) | Reference | Comment |
---|---|---|---|
1.789 | 174.897 | Okamoto, Oguni, et al., 1992 | DH |
1.79 | 174.9 | Okamoto, Oguni, et al., 1992 | AC |

Reaction thermochemistry data

Data compiled as indicated in comments:
M - Michael M. Meot-Ner (Mautner) and Sharon G. Lias
B - John E. Bartmess
ALS - Hussein Y. Afeefy, Joel F. Liebman, and Stephen E. Stein
RCD - Robert C. Dunbar
Individual Reactions
By formula: C3H7O2+ + C3H6O2 = (C3H7O2+ • C3H6O2)
Bond type: Hydrogen bonds of the type OH-O between organics
Quantity | Value | Units | Method | Reference | Comment |
---|---|---|---|---|---|
ΔrH° | 29.1 | kcal/mol | PHPMS | Szulejko and McMahon, 1991 | gas phase; M |
ΔrH° | 29.7 | kcal/mol | ICR | Larson and McMahon, 1982 | gas phase; switching reaction((CH3)2OH+)(CH3)2O, Entropy change calculated or estimated; Grimsrud and Kebarle, 1973, Lias, Liebman, et al., 1984, Keesee and Castleman, 1986; M |
Quantity | Value | Units | Method | Reference | Comment |
ΔrS° | 33.8 | cal/mol*K | PHPMS | Szulejko and McMahon, 1991 | gas phase; M |
ΔrS° | 30.9 | cal/mol*K | N/A | Larson and McMahon, 1982 | gas phase; switching reaction((CH3)2OH+)(CH3)2O, Entropy change calculated or estimated; Grimsrud and Kebarle, 1973, Lias, Liebman, et al., 1984, Keesee and Castleman, 1986; M |
Quantity | Value | Units | Method | Reference | Comment |
ΔrG° | 20.5 | kcal/mol | ICR | Larson and McMahon, 1982 | gas phase; switching reaction((CH3)2OH+)(CH3)2O, Entropy change calculated or estimated; Grimsrud and Kebarle, 1973, Lias, Liebman, et al., 1984, Keesee and Castleman, 1986; M |
C3H5O2- + =
By formula: C3H5O2- + H+ = C3H6O2
Quantity | Value | Units | Method | Reference | Comment |
---|---|---|---|---|---|
ΔrH° | 371.8 ± 2.1 | kcal/mol | G+TS | Bartmess, Scott, et al., 1979 | gas phase; value altered from reference due to change in acidity scale; B |
ΔrH° | 371.8 ± 3.7 | kcal/mol | D-EA | Zimmerman, Reed, et al., 1977 | gas phase; B |
ΔrH° | 375.9 ± 3.5 | kcal/mol | EIAE | Pariat and Allan, 1991 | gas phase; From CH3CO2Me; B |
Quantity | Value | Units | Method | Reference | Comment |
ΔrG° | 365.1 ± 2.0 | kcal/mol | IMRE | Bartmess, Scott, et al., 1979 | gas phase; value altered from reference due to change in acidity scale; B |
By formula: C3H9Sn+ + C3H6O2 = (C3H9Sn+ • C3H6O2)
Quantity | Value | Units | Method | Reference | Comment |
---|---|---|---|---|---|
ΔrH° | 38.4 | kcal/mol | PHPMS | Stone and Splinter, 1984 | gas phase; switching reaction((CH3)3Sn+)CH3OH, Entropy change calculated or estimated; M |
Quantity | Value | Units | Method | Reference | Comment |
ΔrS° | 32.6 | cal/mol*K | N/A | Stone and Splinter, 1984 | gas phase; switching reaction((CH3)3Sn+)CH3OH, Entropy change calculated or estimated; M |
Free energy of reaction
ΔrG° (kcal/mol) | T (K) | Method | Reference | Comment |
---|---|---|---|---|
21.3 | 525. | PHPMS | Stone and Splinter, 1984 | gas phase; switching reaction((CH3)3Sn+)CH3OH, Entropy change calculated or estimated; M |
By formula: C5H12O3 + H2O = 2CH4O + C3H6O2
Quantity | Value | Units | Method | Reference | Comment |
---|---|---|---|---|---|
ΔrH° | -6.426 ± 0.007 | kcal/mol | Cm | Wiberg, Martin, et al., 1985 | liquid phase; solvent: Aqueous dioxane; ALS |
ΔrH° | -6.4641 ± 0.0072 | kcal/mol | Cm | Wiberg and Squires, 1979 | liquid phase; solvent: Water; Hydrolysis; ALS |
By formula: CH6N+ + C3H6O2 = (CH6N+ • C3H6O2)
Bond type: Hydrogen bonds of the type NH+-O between organics
Quantity | Value | Units | Method | Reference | Comment |
---|---|---|---|---|---|
ΔrH° | 23.5 | kcal/mol | PHPMS | Meot-Ner, 1984 | gas phase; M |
Quantity | Value | Units | Method | Reference | Comment |
ΔrS° | 24.8 | cal/mol*K | PHPMS | Meot-Ner, 1984 | gas phase; M |
By formula: NO- + C3H6O2 = (NO- • C3H6O2)
Quantity | Value | Units | Method | Reference | Comment |
---|---|---|---|---|---|
ΔrH° | 39.8 | kcal/mol | ICR | Reents and Freiser, 1981 | gas phase; switching reaction,Thermochemical ladder(NO+)C2H5OH, Entropy change calculated or estimated; Farid and McMahon, 1978; M |
By formula: Li+ + C3H6O2 = (Li+ • C3H6O2)
Quantity | Value | Units | Method | Reference | Comment |
---|---|---|---|---|---|
ΔrH° | 44. | kcal/mol | ICR | Staley and Beauchamp, 1975 | gas phase; switching reaction(Li+)H2O, from graph; Dzidic and Kebarle, 1970 extrapolated; M |
By formula: Na+ + C3H6O2 = (Na+ • C3H6O2)
Free energy of reaction
ΔrG° (kcal/mol) | T (K) | Method | Reference | Comment |
---|---|---|---|---|
23.3 | 298. | IMRE | McMahon and Ohanessian, 2000 | Anchor alanine=39.89; RCD |
By formula: H2O + C3H6O2 = C2H4O2 + CH4O
Quantity | Value | Units | Method | Reference | Comment |
---|---|---|---|---|---|
ΔrH° | 1.05 | kcal/mol | Cm | Coon and Daniels, 1933 | liquid phase; solvent: in HCl; ALS |
By formula: C2H2O + CH4O = C3H6O2
Quantity | Value | Units | Method | Reference | Comment |
---|---|---|---|---|---|
ΔrH° | -36.93 | kcal/mol | Cm | Rice and Greenberg, 1934 | gas phase; ALS |

Henry's Law data

Data compiled by: Rolf Sander
Henry's Law constant (water solution)
kH(T) = k°H exp(d(ln(kH))/d(1/T) ((1/T) - 1/(298.15 K)))
k°H = Henry's law constant for solubility in water at 298.15 K (mol/(kg*bar))
d(ln(kH))/d(1/T) = Temperature dependence constant (K)
k°H (mol/(kg*bar)) | d(ln(kH))/d(1/T) (K) | Method | Reference |
---|---|---|---|
7.8 | 5000. | M | N/A |
8.6 | M | Buttery, Ling, et al., 1969 | |
11. | M | N/A |

Gas phase ion energetics data

Data evaluated as indicated in comments:
HL - Edward P. Hunter and Sharon G. Lias
L - Sharon G. Lias
Data compiled as indicated in comments:
B - John E. Bartmess
LBLHLM - Sharon G. Lias, John E. Bartmess, Joel F. Liebman, John L. Holmes, Rhoda D. Levin, and W. Gary Mallard
LLK - Sharon G. Lias, Rhoda D. Levin, and Sherif A. Kafafi
RDSH - Henry M. Rosenstock, Keith Draxl, Bruce W. Steiner, and John T. Herron
Quantity | Value | Units | Method | Reference | Comment |
---|---|---|---|---|---|
IE (evaluated) | 10.25 ± 0.02 | eV | N/A | N/A | L |
Quantity | Value | Units | Method | Reference | Comment |
Proton affinity (review) | 196.4 | kcal/mol | N/A | Hunter and Lias, 1998 | HL |
Quantity | Value | Units | Method | Reference | Comment |
Gas basicity | 189.0 | kcal/mol | N/A | Hunter and Lias, 1998 | HL |
Ionization energy determinations
IE (eV) | Method | Reference | Comment |
---|---|---|---|
10.2 | PE | Cannington and Ham, 1985 | LBLHLM |
10.25 | PI | Traeger, McLouglin, et al., 1982 | LBLHLM |
10.25 ± 0.05 | PE | Benoit, Harrison, et al., 1977 | LLK |
10.33 | PE | Sweigart and Turner, 1972 | LLK |
10.27 ± 0.02 | PI | Watanabe, Nakayama, et al., 1962 | RDSH |
10.5 | PE | Cannington and Ham, 1985 | Vertical value; LBLHLM |
10.25 | PE | Benoit and Harrison, 1977 | Vertical value; LLK |
11.0 | PE | Rao, 1975 | Vertical value; LLK |
10.59 | PE | Sustmann and Trill, 1972 | Vertical value; LLK |
Appearance energy determinations
Ion | AE (eV) | Other Products | Method | Reference | Comment |
---|---|---|---|---|---|
CHO+ | 13.95 ± 0.08 | ? | EI | Brion and Dunning, 1963 | RDSH |
CH2+ | 20.8 | ? | EI | King and Long, 1958 | RDSH |
CH3+ | 13.07 ± 0.10 | ? | EI | Brion and Dunning, 1963 | RDSH |
CH3O+ | 12.52 ± 0.10 | ? | EI | Brion and Dunning, 1963 | RDSH |
C2H2O+ | 11.81 ± 0.15 | ? | EI | Friedland and Strakna, 1956 | RDSH |
C2H3O+ | 11.05 | CH3O | PI | Traeger, McLouglin, et al., 1982 | LBLHLM |
C2H3O+ | 10.9 ± 0.1 | CH3O | EI | Burgers and Holmes, 1982 | LBLHLM |
C2H3O+ | 10.94 | ? | EI | Holmes and Lossing, 1979 | LLK |
C2H3O+ | 11.37 ± 0.05 | CH3O | EI | Haney and Franklin, 1969 | RDSH |
C2H3O2+ | 11.32 ± 0.05 | CH3 | EI | Blanchette, Holmes, et al., 1986 | LBLHLM |
C2H3O2+ | 12.35 ± 0.03 | CH3 | EI | Briggs and Shannon, 1969 | RDSH |
De-protonation reactions
C3H5O2- + =
By formula: C3H5O2- + H+ = C3H6O2
Quantity | Value | Units | Method | Reference | Comment |
---|---|---|---|---|---|
ΔrH° | 371.8 ± 2.1 | kcal/mol | G+TS | Bartmess, Scott, et al., 1979 | gas phase; value altered from reference due to change in acidity scale; B |
ΔrH° | 371.8 ± 3.7 | kcal/mol | D-EA | Zimmerman, Reed, et al., 1977 | gas phase; B |
ΔrH° | 375.9 ± 3.5 | kcal/mol | EIAE | Pariat and Allan, 1991 | gas phase; From CH3CO2Me; B |
Quantity | Value | Units | Method | Reference | Comment |
ΔrG° | 365.1 ± 2.0 | kcal/mol | IMRE | Bartmess, Scott, et al., 1979 | gas phase; value altered from reference due to change in acidity scale; B |

Ion clustering data

Data compiled as indicated in comments:
M - Michael M. Meot-Ner (Mautner) and Sharon G. Lias
RCD - Robert C. Dunbar
Clustering reactions
By formula: CH6N+ + C3H6O2 = (CH6N+ • C3H6O2)
Bond type: Hydrogen bonds of the type NH+-O between organics
Quantity | Value | Units | Method | Reference | Comment |
---|---|---|---|---|---|
ΔrH° | 23.5 | kcal/mol | PHPMS | Meot-Ner, 1984 | gas phase; M |
Quantity | Value | Units | Method | Reference | Comment |
ΔrS° | 24.8 | cal/mol*K | PHPMS | Meot-Ner, 1984 | gas phase; M |
By formula: C3H7O2+ + C3H6O2 = (C3H7O2+ • C3H6O2)
Bond type: Hydrogen bonds of the type OH-O between organics
Quantity | Value | Units | Method | Reference | Comment |
---|---|---|---|---|---|
ΔrH° | 29.1 | kcal/mol | PHPMS | Szulejko and McMahon, 1991 | gas phase; M |
ΔrH° | 29.7 | kcal/mol | ICR | Larson and McMahon, 1982 | gas phase; switching reaction((CH3)2OH+)(CH3)2O, Entropy change calculated or estimated; Grimsrud and Kebarle, 1973, Lias, Liebman, et al., 1984, Keesee and Castleman, 1986; M |
Quantity | Value | Units | Method | Reference | Comment |
ΔrS° | 33.8 | cal/mol*K | PHPMS | Szulejko and McMahon, 1991 | gas phase; M |
ΔrS° | 30.9 | cal/mol*K | N/A | Larson and McMahon, 1982 | gas phase; switching reaction((CH3)2OH+)(CH3)2O, Entropy change calculated or estimated; Grimsrud and Kebarle, 1973, Lias, Liebman, et al., 1984, Keesee and Castleman, 1986; M |
Quantity | Value | Units | Method | Reference | Comment |
ΔrG° | 20.5 | kcal/mol | ICR | Larson and McMahon, 1982 | gas phase; switching reaction((CH3)2OH+)(CH3)2O, Entropy change calculated or estimated; Grimsrud and Kebarle, 1973, Lias, Liebman, et al., 1984, Keesee and Castleman, 1986; M |
By formula: C3H9Sn+ + C3H6O2 = (C3H9Sn+ • C3H6O2)
Quantity | Value | Units | Method | Reference | Comment |
---|---|---|---|---|---|
ΔrH° | 38.4 | kcal/mol | PHPMS | Stone and Splinter, 1984 | gas phase; switching reaction((CH3)3Sn+)CH3OH, Entropy change calculated or estimated; M |
Quantity | Value | Units | Method | Reference | Comment |
ΔrS° | 32.6 | cal/mol*K | N/A | Stone and Splinter, 1984 | gas phase; switching reaction((CH3)3Sn+)CH3OH, Entropy change calculated or estimated; M |
Free energy of reaction
ΔrG° (kcal/mol) | T (K) | Method | Reference | Comment |
---|---|---|---|---|
21.3 | 525. | PHPMS | Stone and Splinter, 1984 | gas phase; switching reaction((CH3)3Sn+)CH3OH, Entropy change calculated or estimated; M |
By formula: Li+ + C3H6O2 = (Li+ • C3H6O2)
Quantity | Value | Units | Method | Reference | Comment |
---|---|---|---|---|---|
ΔrH° | 44. | kcal/mol | ICR | Staley and Beauchamp, 1975 | gas phase; switching reaction(Li+)H2O, from graph; Dzidic and Kebarle, 1970 extrapolated; M |
By formula: NO- + C3H6O2 = (NO- • C3H6O2)
Quantity | Value | Units | Method | Reference | Comment |
---|---|---|---|---|---|
ΔrH° | 39.8 | kcal/mol | ICR | Reents and Freiser, 1981 | gas phase; switching reaction,Thermochemical ladder(NO+)C2H5OH, Entropy change calculated or estimated; Farid and McMahon, 1978; M |
By formula: Na+ + C3H6O2 = (Na+ • C3H6O2)
Free energy of reaction
ΔrG° (kcal/mol) | T (K) | Method | Reference | Comment |
---|---|---|---|---|
23.3 | 298. | IMRE | McMahon and Ohanessian, 2000 | Anchor alanine=39.89; RCD |

Kovats' RI, non-polar column, isothermal

View large format table.

Column type Active phase Temperature (C) I Reference Comment
CapillaryDB-180.501.15Mijin and Antonovic, 200630. m/0.256 mm/0.25 μm, N2
CapillaryDB-580.522.17Mijin and Antonovic, 200660. m/0.321 mm/0.25 μm, N2
CapillaryHP-10.520.6Wang, Liu, et al., 200530. m/0.25 mm/0.25 μm
CapillaryHP-110.521.Wang, Liu, et al., 200530. m/0.25 mm/0.25 μm
CapillaryHP-120.526.2Wang, Liu, et al., 200530. m/0.25 mm/0.25 μm
CapillaryHP-130.521.3Wang, Liu, et al., 200530. m/0.25 mm/0.25 μm
CapillaryHP-140.515.7Wang, Liu, et al., 200530. m/0.25 mm/0.25 μm
CapillaryHP-150.513.8Wang, Liu, et al., 200530. m/0.25 mm/0.25 μm
CapillaryHP-160.511.5Wang, Liu, et al., 200530. m/0.25 mm/0.25 μm
CapillarySE-54110.529.7Grigor'eva, Vasil'ev, et al., 198915. m/0.28 mm/2.5 μm, Ar
CapillarySE-54130.525.7Grigor'eva, Vasil'ev, et al., 198915. m/0.28 mm/2.5 μm, Ar
CapillarySE-54150.523.7Grigor'eva, Vasil'ev, et al., 198915. m/0.28 mm/2.5 μm, Ar
CapillarySE-54110.530.Grigor'eva, Vasil'ev, et al., 198915. m/0.28 mm/2.5 μm, Ar
CapillarySE-54130.525.7Grigor'eva, Vasil'ev, et al., 198915. m/0.28 mm/2.5 μm, Ar
CapillarySE-54150.522.4Grigor'eva, Vasil'ev, et al., 198915. m/0.28 mm/2.5 μm, Ar
CapillarySE-30100.505.Tarjan, Nyiredy, et al., 1989
CapillarySE-3080.505.Tarjan, Nyiredy, et al., 1989
CapillarySE-30100.505.Haken and Korhonen, 1986N2; Column length: 25. m; Column diameter: 0.33 mm
CapillarySE-3060.509.Haken and Korhonen, 1986N2; Column length: 25. m; Column diameter: 0.33 mm
CapillarySE-3080.505.Haken and Korhonen, 1986N2; Column length: 25. m; Column diameter: 0.33 mm
CapillaryApiezon L + KF70.529.Svetlova, Samusenko, et al., 198630. m/0.25 mm/0.06 μm
CapillarySE-30100.560.Haken, Madden, et al., 1983Column length: 25. m; Column diameter: 0.22 mm
CapillaryOV-10180.525.9Komárek, Hornová, et al., 1982N2; Column length: 15. m; Column diameter: 0.22 mm
PackedSE-30150.509.Haken, Ho, et al., 1975Column length: 3.7 m
PackedSE-30150.509.Ashes and Haken, 1974Celaton (62-72 mesh); Column length: 3.7 m
PackedSE-30100.505.Zarazir, Chovin, et al., 1970Chromosorb W; Column length: 2. m
PackedSE-30150.506.Germaine and Haken, 1969Celite 560; Column length: 3.7 m
PackedSE-3080.510.Viani, Müggler-Chavan, et al., 1965He, Chromosorb P; Column length: 6. m

Kovats' RI, non-polar column, temperature ramp

View large format table.

Column type Active phase I Reference Comment
CapillarySE-54531.Rembold, Wallner, et al., 198930. m/0.25 mm/0.25 μm, He, 0. C @ 12. min, 12. K/min; Tend: 250. C

Kovats' RI, non-polar column, custom temperature program

View large format table.

Column type Active phase I Reference Comment
CapillarySE-30509.Chretien and Dubois, 1978Program: not specified

Kovats' RI, polar column, isothermal

View large format table.

Column type Active phase Temperature (C) I Reference Comment
CapillaryOV-351100.844.Haken and Korhonen, 1986N2; Column length: 25. m; Column diameter: 0.32 mm
CapillaryOV-351120.877.Haken and Korhonen, 1986N2; Column length: 25. m; Column diameter: 0.32 mm
CapillaryOV-35160.823.Haken and Korhonen, 1986N2; Column length: 25. m; Column diameter: 0.32 mm
CapillaryOV-35180.839.Haken and Korhonen, 1986N2; Column length: 25. m; Column diameter: 0.32 mm
PackedCarbowax 20M75.850.Goebel, 1982N2, Kieselgur (60-100 mesh); Column length: 2. m
PackedCarbowax 20M100.836.Zarazir, Chovin, et al., 1970Chromosorb W; Column length: 2. m

Kovats' RI, polar column, temperature ramp

View large format table.

Column type Active phase I Reference Comment
CapillaryCBP-20832.Shimadzu, 200325. m/0.2 mm/0.25 μm, He, 50. C @ 5. min, 4. K/min; Tend: 200. C
CapillaryDB-Wax810.Shimoda and Shibamoto, 1990He, 40. C @ 6. min, 3. K/min; Column length: 60. m; Column diameter: 0.25 mm; Tend: 190. C
CapillaryDB-Wax827.Tatsuka, Suekane, et al., 199060. m/0.25 mm/0.25 μm, He, 40. C @ 5. min, 3. K/min; Tend: 200. C
CapillaryDB-Wax828.Tatsuka, Suekane, et al., 199060. m/0.25 mm/0.25 μm, He, 40. C @ 5. min, 3. K/min; Tend: 200. C

Kovats' RI, polar column, custom temperature program

View large format table.

Column type Active phase I Reference Comment
PackedCarbowax 20M798.Kevei and Kozma, 1976Chromosorb; Program: not specified

Van Den Dool and Kratz RI, non-polar column, temperature ramp

View large format table.

Column type Active phase I Reference Comment
CapillaryDB-5522.Bylaite and Meyer, 200630. m/0.25 mm/1. μm, 50. C @ 1. min, 10. K/min, 290. C @ 10. min
CapillaryCP-Sil 8CB-MS531.Hierro, de la Hoz, et al., 200460. m/0.25 mm/0.25 μm, 40. C @ 2. min, 4. K/min, 280. C @ 5. min
CapillaryPetrocol DH517.2Censullo, Jones, et al., 200350. m/0.25 mm/0.5 μm, He, 35. C @ 10. min, 3. K/min, 200. C @ 10. min
CapillaryDB-5526.3Xu, van Stee, et al., 200330. m/0.25 mm/1. μm, He, 2.5 K/min; Tstart: 50. C; Tend: 200. C
CapillaryCP Sil 5 CB506.Pino, Marbot, et al., 200230. m/0.25 mm/0.25 μm, H2, 60. C @ 10. min, 2. K/min, 280. C @ 40. min
CapillarySPB-1511.Larráyoz, Addis, et al., 200130. m/0.32 mm/4. μm, He, 45. C @ 13. min, 5. K/min, 240. C @ 5. min
CapillaryCP Sil 5 CB511.Pino, Marbot, et al., 200150. m/0.32 mm/0.4 μm, He, 60. C @ 10. min, 3. K/min, 280. C @ 60. min
CapillaryOV-101521.3Golovnya, Syomina, et al., 199750. m/0.25 mm/0.25 μm, He, 8. K/min; Tstart: 140. C
CapillarySE-30516.7Grigor'eva, Golovnya, et al., 199725. m/0.32 mm/1. μm, He, 8. K/min; Tstart: 140. C

Van Den Dool and Kratz RI, non-polar column, custom temperature program

View large format table.

Column type Active phase I Reference Comment
CapillaryBPX-5536.Dharmawan, Kasapis, et al., 200730. m/0.25 mm/0.25 μm, He; Program: 35C => 4C/min => 200C => 30C/min => 300C (3min)
CapillaryHP-5515.Boué, Shih, et al., 200350. m/0.2 mm/0.5 μm, He; Program: 40C(3min) => 10C/min => 60C =3C/min => 150C => 20C/min => 250C (5min)
CapillaryDB-5559.Beaulieu and Grimm, 200130. m/0.25 mm/0.25 μm, He; Program: 50C (1min) => 5C/min => 100C => 10C/min => 250C (9min)

Van Den Dool and Kratz RI, polar column, temperature ramp

View large format table.

Column type Active phase I Reference Comment
CapillaryDB-Wax839.Gurbuz O., Rouseff J.M., et al., 200660. m/0.25 mm/0.25 μm, He, 7. K/min, 265. C @ 5. min; Tstart: 40. C
CapillaryCP-Wax 52CB826.Kourkoutas, Elmore, et al., 200660. m/0.25 mm/0.25 μm, He, 4. K/min; Tstart: 40. C; Tend: 250. C
CapillaryDB-Wax864.Varming, Petersen, et al., 200430. m/0.25 mm/0.25 μm, He, 40. C @ 10. min, 6. K/min, 240. C @ 25. min
CapillaryCarbowax832.8Censullo, Jones, et al., 200360. m/0.25 mm/0.5 μm, He, 50. C @ 10. min, 5. K/min, 250. C @ 10. min
CapillaryHP-Wax801.Peng, 200015. m/0.53 mm/1. μm, He, 40. C @ 3. min, 5. K/min, 220. C @ 30. min
CapillaryFFAP834.Ott, Fay, et al., 199730. m/0.25 mm/0.25 μm, He, 20. C @ 1. min, 4. K/min, 200. C @ 1. min
CapillaryDB-Wax825.Iwaoka, Hagi, et al., 1994He, 40. C @ 5. min, 2. K/min; Column length: 30. m; Column diameter: 0.25 mm; Tend: 200. C
CapillaryDB-Wax829.Sumitani, Suekane, et al., 1994He, 40. C @ 5. min, 3. K/min; Column length: 60. m; Column diameter: 0.25 mm; Tend: 200. C
CapillaryDB-Wax827.Umano, Hagi, et al., 1992He, 40. C @ 10. min, 2. K/min; Column length: 30. m; Column diameter: 0.25 mm; Tend: 200. C
CapillaryCarbowax 20M817.Chen, Kuo, et al., 1982He, 50. C @ 10. min, 1. K/min; Tend: 160. C

Van Den Dool and Kratz RI, polar column, custom temperature program

View large format table.

Column type Active phase I Reference Comment
CapillarySupelcowax-10825.Bianchi, Cantoni, et al., 200730. m/0.25 mm/0.25 μm; Program: 35C(8min) => 4C/min => 60C => 6C/min => 160C => 20C/min => 220C(1min)
CapillarySupelcowax-10828.Bianchi, Careri, et al., 200730. m/0.25 mm/0.25 μm, He; Program: 35C(8min) => 4C/min => 60C => 6C/min => 160C => 20C/min => 200C(1min)
CapillarySupelcowax-10825.Bianchi, Careri, et al., 200730. m/0.25 mm/0.25 μm, He; Program: 35C(8min) => 4C/min => 60C => 6C/min => 160C => 20C/min => 200C(1min)

Normal alkane RI, non-polar column, isothermal

View large format table.

Column type Active phase Temperature (C) I Reference Comment
CapillaryPolydimethyl siloxane105.512.Tello, Lebron-Aguilar, et al., 2009
CapillaryPolydimethyl siloxane75.513.Tello, Lebron-Aguilar, et al., 2009
CapillaryPolydimethyl siloxane90.513.Tello, Lebron-Aguilar, et al., 2009
CapillaryMethyl Silicone100.510.Lebrón-Aguilar, Quintanilla-López, et al., 2007
CapillaryMethyl Silicone120.511.Lebrón-Aguilar, Quintanilla-López, et al., 2007
CapillaryMethyl Silicone140.507.Lebrón-Aguilar, Quintanilla-López, et al., 2007
CapillaryMethyl Silicone80.512.Lebrón-Aguilar, Quintanilla-López, et al., 2007
CapillaryDB-160.515.Shimadzu, 2003, 260. m/0.32 mm/1. μm, He
PackedSE-3070.524.Yabumoto, Jennings, et al., 1977

Normal alkane RI, non-polar column, temperature ramp

View large format table.

Column type Active phase I Reference Comment
CapillaryHP-5515.3Leffingwell and Alford, 200560. m/0.32 mm/0.25 μm, He, 30. C @ 2. min, 2. K/min, 260. C @ 28. min
CapillaryMDN-5525.van Loon, Linssen, et al., 200560. m/0.25 mm/0.25 μm, He, 40. C @ 4. min, 4. K/min, 270. C @ 5. min
CapillaryBP-1511.Health Safety Executive, 200050. m/0.22 mm/0.75 μm, He, 5. K/min; Tstart: 50. C; Tend: 200. C
CapillaryDB-5515.Shimoda, Shibamoto, et al., 199360. m/0.25 mm/0.25 μm, He, 40. C @ 2. min, 3. K/min; Tend: 200. C
CapillaryDB-1513.Habu, Flath, et al., 19853. K/min; Column length: 50. m; Column diameter: 0.32 mm; Tstart: 0. C; Tend: 250. C
CapillaryOV-101519.del Rosario, de Lumen, et al., 1984He, 0. C @ 1. min, 3. K/min; Column length: 50. m; Column diameter: 0.31 mm; Tend: 225. C
CapillarySP 2100509.Labropoulos, Palmer, et al., 1982Helium, 10. K/min; Column length: 40. m; Column diameter: 0.20 mm; Tstart: 40. C; Tend: 200. C

Normal alkane RI, non-polar column, custom temperature program

View large format table.

Column type Active phase I Reference Comment
CapillaryDB-5531.Miyazaki, Plotto, et al., 201160. m/0.25 mm/1.00 μm, Helium; Program: 40 0C 4 0C/min -> 230 0C 100 0C/min -> 260 0C (11.7 min)
CapillaryHP-5528.Rotsatschakul, Visesanguan, et al., 200960. m/0.25 mm/0.25 μm, Helium; Program: 30 0C (2 min) 2 0Cmin -> 60 0C 10 0C/min -> 100 0C 20 0C/min -> 140 0C 10 0C/min -> 200 0C (10 min)
CapillarySqualane509.Chen, 2008Program: not specified
CapillaryMethyl Silicone509.Chen and Feng, 2007Program: not specified
CapillaryVB-5525.Karlshøj, Nielsen, et al., 200760. m/0.25 mm/1. μm, He; Program: 35C(1min) => 4C/min => 175C => 10C/min => 260C
CapillarySE-30509.Liu, Liang, et al., 2007Program: not specified
CapillaryDB-5559.Beaulieu, 200560. m/0.25 mm/0.25 μm; Program: 50C => 5C/min => 100C => 15C/min => 250C (19C)
CapillaryDB-5523.Garcia-Estaban, Ansorena, et al., 200450. m/0.32 mm/1.05 μm; Program: 40C(10min) => 5C/min => 200C => 20C/min => 250C (5min)
CapillarySE-30513.Vinogradov, 2004Program: not specified
CapillaryMethyl Silicone509.N/AProgram: not specified
CapillaryDB-5530.Dittmann and Nitz, 2000Program: not specified
CapillarySPB-1512.Flanagan, Streete, et al., 199760. m/0.53 mm/5. μm, He; Program: 40C(6min) => 5C/min => 80C => 10C/min => 200C
CapillaryPolydimethyl siloxanes510.Zenkevich and Chupalov, 1996Program: not specified
CapillaryDB-1507.Schuberth, 199430. m/0.25 mm/1. μm, He; Program: 40C (4min) => 10C/min => 200C => 50C/min => 250C
CapillarySPB-1512.Strete, Ruprah, et al., 199260. m/0.53 mm/5.0 μm, Helium; Program: 40 0C (6 min) 5 0C/min -> 80 0C 10 0C/min -> 200 0C
CapillarySPB-1513.Strete, Ruprah, et al., 199260. m/0.53 mm/5.0 μm, Helium; Program: not specified
CapillaryCP Sil 8 CB524.Weller and Wolf, 198940. m/0.25 mm/0.25 μm, He; Program: 30 0C (1 min) 15 0C/min -> 45 0C 3 0C/min -> 120 0C
CapillaryDB-1508.Takeoka, Flath, et al., 198830. m/0.25 mm/0.25 μm, H2; Program: 30C (2min) => 2C/min => 150C => 4C/min => 250C
CapillaryDB-1508.Takeoka, Flath, et al., 198830. m/0.25 mm/0.25 μm, H2; Program: 30C (2min) => 2C/min => 150C => 4C/min => 250C
CapillarySF96+Igepal519.Flath, Altieri, et al., 1984Column length: 152. m; Column diameter: 0.76 mm; Program: 25C(1min) => 5C/min => 50C (4min) => 1.25C/min => 180C
CapillaryOV-1513.Ramsey and Flanagan, 1982Program: not specified

Normal alkane RI, polar column, isothermal

View large format table.

Column type Active phase Temperature (C) I Reference Comment
CapillaryDB-Wax60.848.Shimadzu, 2003, 250. m/0.32 mm/1. μm, He
PackedCarbowax 20M100.818.Yabumoto, Jennings, et al., 1977

Normal alkane RI, polar column, temperature ramp

View large format table.

Column type Active phase I Reference Comment
CapillaryZB-Wax843.Marin, Pozrl, et al., 200860. m/0.32 mm/0.50 μm, Helium, 40. C @ 5. min, 4. K/min, 220. C @ 5. min
CapillaryTR-WAX828.Tena N., Lazzez A., et al., 200760. m/0.25 mm/0.25 μm, H2, 40. C @ 10. min, 3. K/min, 200. C @ 10. min
CapillaryDB-Wax813.Rizzolo, Cambiaghi, et al., 200560. m/0.53 mm/1. μm, 50. C @ 10. min, 3. K/min; Tend: 180. C
CapillaryDB-Wax832.Chida, Sone, et al., 200460. m/0.25 mm/0.5 μm, 35. C @ 5. min, 4. K/min, 240. C @ 10. min
CapillarySupelcowax-10828.Vichi, Castellote, et al., 200330. m/0.25 mm/0.25 μm, He, 40. C @ 10. min, 3. K/min; Tend: 200. C
CapillarySupelcowax-10826.Vichi, Pizzale, et al., 200330. m/0.25 mm/0.25 μm, He, 40. C @ 10. min, 3. K/min; Tend: 200. C
CapillaryHP-Wax782.Sanz, Maeztu, et al., 200260. m/0.25 mm/0.5 μm, He, 40. C @ 6. min, 3. K/min; Tend: 190. C
CapillaryDB-Wax856.Umano, Hagi, et al., 200260. m/0.25 mm/0.25 μm, He, 40. C @ 2. min, 2. K/min; Tend: 200. C
CapillaryDB-Wax822.Duque, Bonilla, et al., 200130. m/0.25 mm/0.25 μm, Helium, 4. K/min, 220. C @ 30. min; Tstart: 25. C
CapillaryHP-Wax782.Maeztu, Sanz, et al., 200160. m/0.25 mm/0.5 μm, He, 40. C @ 6. min, 3. K/min; Tend: 190. C
CapillaryHP-Wax782.Sanz, Ansorena, et al., 200160. m/0.25 mm/0.5 μm, He, 40. C @ 6. min, 3. K/min; Tend: 190. C
CapillaryDB-Wax825.Takeoka, Flath, et al., 198860. m/0.25 mm/0.25 μm, H2, 30. C @ 2. min, 2. K/min; Tend: 180. C
CapillaryDB-Wax827.Takeoka, Flath, et al., 198860. m/0.25 mm/0.25 μm, H2, 30. C @ 2. min, 2. K/min; Tend: 180. C
CapillaryCarbowax 20M837.Labropoulos, Palmer, et al., 1982Helium, 10. K/min; Column length: 31. m; Column diameter: 0.50 mm; Tstart: 40. C; Tend: 200. C

Normal alkane RI, polar column, custom temperature program

View large format table.

Column type Active phase I Reference Comment
CapillaryCarbowax 20M845.Lee, Chong, et al., 2012Program: not specified
CapillarySOLGel-Wax825.Johanningsmeier and McFeeters, 201130. m/0.25 mm/0.25 μm, Helium; Program: 40 0C (2 min) 5 0C/min -> 140 0C 10 0C/min -> 250 0C (3 min)
CapillarySOLGel-Wax825.Johanningsmeier and McFeeters, 201130. m/0.25 mm/0.25 μm, Helium; Program: 40 0C (2 min) 5 0C/min -> 140 0C 10 0C/min -> 250 0C (3 min)
CapillarySOLGel-Wax828.Johanningsmeier and McFeeters, 201130. m/0.25 mm/0.25 μm, Helium; Program: not specified
CapillaryDB-Wax784.Miyazaki, Plotto, et al., 201160. m/0.25 mm/0.50 μm, Helium; Program: 40 0C 4 0C/min -> 230 0C 100 0C/min -> 260 0C (11.7 min)
CapillaryHP-Innowax834.Xiao, Dai, et al., 201160. m/0.25 mm/0.25 μm, Helium; Program: 40 0C (2 min) 3 0C/min -> 150 0C 5 0C/min -> 220 0C (5 min)
CapillaryFFAP854.Ortiz, Echeverra, et al., 200950. m/0.20 mm/0.33 μm, Helium; Program: 70 0C (1 min) 3 0C/min -> 142 0C 5 0C/min -> 225 0C (10 min)
CapillarySupelcowax 10826.Soria, Martinez-Castro, et al., 200850. m/0.25 mm/0.25 μm, Helium; Program: 45 0C (15 min) 3 0C/min -> 75 0C 5 0C/min -> 180 0C (10 min)
CapillaryDB-Wax827.Gonzalez-Rios, Suarez-Quiroz, et al., 200730. m/0.25 mm/0.25 μm, Hydrogen; Program: 44 0C 3 0C/min -> 170 0C 8 0C/min -> 250 0C
CapillaryDB-Wax813.Gonzalez-Rios, Suarez-Quiroz, et al., 200730. m/0.25 mm/0.25 μm, Hydrogen; Program: not specified
CapillaryFFAP834.Lopez, Villatoro, et al., 200750. m/0.2 mm/0.33 μm, He; Program: 70C(1min) => 3C/min => 142C => 5C/min => 225C(10min)
CapillaryHP-Innowax804.Viegas and Bassoli, 200760. m/0.32 mm/0.25 μm, Helium; Program: 40 0C (5 min) 4 0C/min -> 60 0C (5 min) 8 0C/min -> 250 0C (3 min)
CapillaryHP-Innowax834.Viegas and Bassoli, 200760. m/0.32 mm/0.25 μm, Helium; Program: not specified
CapillaryFFAP834.Echeverría, Correa, et al., 200450. m/0.2 mm/0.33 μm, He; Program: 70C(1min) => 3C/min => 142C => 5C/min => 225C(10min)
CapillaryCarbowax 20M813.Vinogradov, 2004Program: not specified
CapillaryHP-FFAP834.Echeverria, Fuentes, et al., 200350. m/0.2 mm/0.33 μm, He; Program: 70C(1min) => 3C/min => 142C => 5C/min => 225C (10min)
CapillaryFFAP841.Lopez, Lavilla, et al., 200050. m/0.2 mm/0.33 μm, N2; Program: 70C(1min) => 3C/min => 142C(2min) => 25C/min => 230C(5min)
CapillaryCross-linked FFAP841.Lavilla, Puy, et al., 199950. m/0.2 mm/0.33 μm, N2; Program: 70C(1min) => 3C/min => 142C (2min) => 25C/min => 230C(5min)
CapillaryCarbowax 400, Carbowax 20M, Carbowax 1540, Carbowax 4000, Superox 06, PEG 20M, etc.827.Waggott and Davies, 1984Hydrogen; Column length: 50. m; Column diameter: 0.32 mm; Program: not specified
CapillaryCarbowax 20M796.Ramsey and Flanagan, 1982Program: not specified

References

Shimanouchi, 1972
Shimanouchi, T.,
Tables of Molecular Vibrational Frequencies Consolidated Volume I, National Bureau of Standards, 1972, 1-160. [all data]