Acetic acid, hydroxy-
- Formula: C2H4O3
- Molecular weight: 76.0514
- IUPAC Standard InChIKey: AEMRFAOFKBGASW-UHFFFAOYSA-N
- CAS Registry Number: 79-14-1
- Chemical structure:

Gas phase thermochemistry data

Data compiled by: Glushko Thermocenter, Russian Academy of Sciences, Moscow
Constant pressure heat capacity of gas
Cp,gas (J/mol*K) | Temperature (K) | Reference | Comment |
---|---|---|---|
37.86 | 50. | Dorofeeva O.V., 1997 | p=1 bar. |
46.44 | 100. | ||
56.01 | 150. | ||
65.66 | 200. | ||
85. ± 2. | 298.15 | ||
85.09 | 300. | ||
104.05 | 400. | ||
120.61 | 500. | ||
133.95 | 600. | ||
144.36 | 700. | ||
152.48 | 800. | ||
158.94 | 900. | ||
164.19 | 1000. | ||
168.54 | 1100. | ||
172.22 | 1200. | ||
175.37 | 1300. | ||
178.10 | 1400. | ||
180.47 | 1500. |

Phase change data

Data compiled by: William E. Acree, Jr., James S. Chickos
Enthalpy of vaporization
ΔvapH (kJ/mol) | Temperature (K) | Method | Reference | Comment |
---|---|---|---|---|
51.8 | 362. | A | Stephenson and Malanowski, 1987 | Based on data from 350. to 375. K. |

Reaction thermochemistry data

Data compiled by: John E. Bartmess
Individual Reactions
C2H3O3- + =
By formula: C2H3O3- + H+ = C2H4O3
Quantity | Value | Units | Method | Reference | Comment |
---|---|---|---|---|---|
ΔrH° | 1390. ± 9.6 | kJ/mol | TDEq | Caldwell, Renneboog, et al., 1989 | gas phase |
Quantity | Value | Units | Method | Reference | Comment |
ΔrG° | 1372. ± 8.4 | kJ/mol | TDEq | Caldwell, Renneboog, et al., 1989 | gas phase |

Gas phase ion energetics data

Data compiled by: John E. Bartmess
De-protonation reactions
C2H3O3- + =
By formula: C2H3O3- + H+ = C2H4O3
Quantity | Value | Units | Method | Reference | Comment |
---|---|---|---|---|---|
ΔrH° | 332.3 ± 2.3 | kcal/mol | TDEq | Caldwell, Renneboog, et al., 1989 | gas phase |
Quantity | Value | Units | Method | Reference | Comment |
ΔrG° | 327.8 ± 2.0 | kcal/mol | TDEq | Caldwell, Renneboog, et al., 1989 | gas phase |

References

Dorofeeva O.V., 1997
Dorofeeva O.V.,
Unpublished results. Thermocenter of Russian Academy of Science, Moscow, 1997. [all data]
Stephenson and Malanowski, 1987
Stephenson, Richard M.; Malanowski, Stanislaw,
Handbook of the Thermodynamics of Organic Compounds, 1987, https://doi.org/10.1007/978-94-009-3173-2
. [all data]
Caldwell, Renneboog, et al., 1989
Caldwell, G.; Renneboog, R.; Kebarle, P.,
Gas Phase Acidities of Aliphatic Carboxylic Acids, Based on Measurements of Proton Transfer Equilibria,
Can. J. Chem., 1989, 67, 4, 661, https://doi.org/10.1139/v89-092
. [all data]