Trichloroethylene
- Formula: C2HCl3
- Molecular weight: 131.388
- IUPAC Standard InChIKey: XSTXAVWGXDQKEL-UHFFFAOYSA-N
- CAS Registry Number: 79-01-6
- Chemical structure:
View 3d structure (requires JavaScript / HTML 5) - Other names: Ethene, trichloro-; Ethylene, trichloro-; Algylen; Anamenth; Chlorilen; Chlorylen; Chorylen; Densinfluat; Ethinyl trichloride; Ethylene trichloride; Fluate; Gemalgene; Germalgene; Narcogen; Narkogen; Narkosoid; Threthylen; Threthylene; Trethylene; Tri; Tri-Clene; Trichloran; Trichloren; Trichloroethene; Trielene; Trilen; Trilene; Trimar; Westrosol; 1,1,2-Trichloroethene; C2HCl3; Acetylene trichloride; 1-Chloro-2,2-dichloroethylene; 1,1-Dichloro-2-chloroethylene; 1,1,2-Trichloroethylene; Benzinol; Blacosolv; Blancosolv; Cecolene; Chlorylea; Circosolv; Crawhaspol; Dow-tri; Dukeron; Fleck-flip; Flock FLIP; Lanadin; Lethurin; NCI-C04546; Nialk; Perm-A-chlor; Perm-A-clor; Petzinol; Philex; RCRA Waste number U228; TCE; Triad; Trial; Triasol; Trichlooretheen; Trichloorethyleen, tri; Trichloraethen; Trichloraethylen, tri; Trichlorethene; Trichlorethylene; Trichlorethylene, tri; 1,2,2-Trichloroethylene; Tricloretene; Tricloroetilene; Trielin; Trielina; Trieline; Triklone; Triline; Triol; Tri-plus; Tri-plus M; UN 1710; Vestrol; Vitran; Distillex DS2; Ethene, 1,1,2-trichloro-; R 1120; Triklone N

Gas phase thermochemistry data

Data compiled as indicated in comments:
DRB - Donald R. Burgess, Jr.
ALS - Hussein Y. Afeefy, Joel F. Liebman, and Stephen E. Stein
Quantity | Value | Units | Method | Reference | Comment |
---|---|---|---|---|---|
ΔfH°gas | -18. ± 2. | kJ/mol | Review | Manion, 2002 | derived from recommended ΔfHliquid° and ΔvapH°; DRB |
ΔfH°gas | -19.1 ± 3.0 | kJ/mol | Ccr | Papina and Kolesov, 1985 | ALS |
ΔfH°gas | -5.9 | kJ/mol | Cm | Kirkbride, 1956 | ALS |

Reaction thermochemistry data

Data compiled by: Hussein Y. Afeefy, Joel F. Liebman, and Stephen E. Stein
Individual Reactions
By formula: C2H2Cl4 = HCl + C2HCl3
Quantity | Value | Units | Method | Reference | Comment |
---|---|---|---|---|---|
ΔrH° | 43.9 | kJ/mol | Eqk | Levanova, Bushneva, et al., 1979 | gas phase |
ΔrH° | 45.40 | kJ/mol | Eqk | Levanova, Bushneva, et al., 1976 | liquid phase; At 333 K |
By formula: C2H2Cl4 = HCl + C2HCl3
Quantity | Value | Units | Method | Reference | Comment |
---|---|---|---|---|---|
ΔrH° | 55.2 | kJ/mol | Eqk | Levanova, Bushneva, et al., 1979 | liquid phase |
ΔrH° | 44.8 | kJ/mol | Eqk | Levanova, Bushneva, et al., 1979 | gas phase |
By formula: H2CaO2 + 2C2H2Cl4 = CaCl2 + 2H2O + 2C2HCl3
Quantity | Value | Units | Method | Reference | Comment |
---|---|---|---|---|---|
ΔrH° | -150. | kJ/mol | Cm | Kirkbride, 1956 | liquid phase |
By formula: Cl2 + C2HCl3 = C2HCl5
Quantity | Value | Units | Method | Reference | Comment |
---|---|---|---|---|---|
ΔrH° | -151. | kJ/mol | Cm | Kirkbride, 1956 | liquid phase |

Henry's Law data

Data compiled by: Rolf Sander
Henry's Law constant (water solution)
kH(T) = k°H exp(d(ln(kH))/d(1/T) ((1/T) - 1/(298.15 K)))
k°H = Henry's law constant for solubility in water at 298.15 K (mol/(kg*bar))
d(ln(kH))/d(1/T) = Temperature dependence constant (K)
k°H (mol/(kg*bar)) | d(ln(kH))/d(1/T) (K) | Method | Reference | Comment |
---|---|---|---|---|
0.10 | 4600. | L | N/A | |
0.12 | 3600. | M | N/A | |
0.13 | M | N/A | ||
0.11 | M | N/A | ||
0.097 | 3500. | M | N/A | |
0.11 | 4400. | X | N/A | |
0.12 | 3900. | X | N/A | |
0.11 | 4200. | M | N/A | |
0.10 | 4100. | X | N/A | |
0.085 | Q | N/A | missing citation give several references for the Henry's law constants but don't assign them to specific species. | |
0.10 | 5200. | X | N/A | |
0.13 | 5200. | M | N/A | |
0.098 | 2100. | X | N/A | |
0.096 | 3700. | X | N/A | |
0.11 | 4800. | M | Gossett, 1987 | |
0.096 | 4700. | X | N/A | |
0.11 | 4300. | X | N/A | |
0.098 | 4900. | X | N/A | |
0.099 | 4900. | M | N/A | |
0.088 | 1600. | X | N/A | |
0.10 | 4700. | X | Leighton and Calo, 1981 | |
0.082 | L | N/A | ||
0.074 | 4800. | X | N/A | |
0.081 | 4000. | X | N/A | |
0.083 | V | N/A | ||
0.10 | V | N/A | Value at T = 293. K. | |
0.24 | V | N/A | Value at T = 275. K. | |
0.085 | V | N/A | ||
0.11 | M | Pearson and McConnell, 1975 | The same data was also published in missing citation. Value at T = 293. K. |

Kovats' RI, non-polar column, isothermal

Column type | Active phase | Temperature (C) | I | Reference | Comment |
---|---|---|---|---|---|
Capillary | OV-1 | 70. | 694. | Annino and Villalobos, 1999 | 22.6 m/0.53 mm/2.78 μm |
Capillary | DB-1 | 60. | 691. | Dewulf, Van Langenhove, et al., 1997 | 30. m/0.53 mm/5.0 μm, He |
Capillary | OV-1 | 50. | 688. | Villalobos, 1995 | 30. m/0.32 mm/0.96 μm |
Capillary | SPB-1 | 60. | 675. | Castello, Vezzani, et al., 1991 | N2; Column length: 60. m; Column diameter: 0.75 mm |
Packed | OV-1 | 100. | 696. | Castello and Gerbino, 1988 | He, Chromosorb W DMCS; Column length: 3. m |
Packed | OV-1 | 125. | 702. | Castello and Gerbino, 1988 | He, Chromosorb W DMCS; Column length: 3. m |
Packed | OV-1 | 75. | 691. | Castello and Gerbino, 1988 | He, Chromosorb W DMCS; Column length: 3. m |
Packed | Squalane | 80. | 686. | Pacáková, Vojtechová, et al., 1988 | N2, Chezasorb AW-HMDS; Column length: 1.2 m |
Packed | SE-30 | 150. | 710. | Tiess, 1984 | Ar, Gas Chrom Q (80-100 mesh); Column length: 3. m |
Packed | SE-30 | 100. | 698. | Winskowski, 1983 | Gaschrom Q; Column length: 2. m |

Kovats' RI, non-polar column, temperature ramp

Column type | Active phase | I | Reference | Comment |
---|---|---|---|---|
Capillary | CBP-1 | 690. | Shimadzu, 2003 | 25. m/0.2 mm/0.25 μm, He, 50. C @ 5. min, 4. K/min; Tend: 200. C |
Capillary | SE-54 | 693. | Rembold, Wallner, et al., 1989 | 30. m/0.25 mm/0.25 μm, He, 0. C @ 12. min, 12. K/min; Tend: 250. C |

Kovats' RI, polar column, isothermal

Column type | Active phase | Temperature (C) | I | Reference | Comment |
---|---|---|---|---|---|
Capillary | Carbowax 20M | 70. | 1008. | Annino and Villalobos, 1999 | 31.3 m/0.53 mm/0.54 μm |
Capillary | Carbowax 20M | 50. | 1019. | Villalobos, 1995 | 30. m/0.32 mm/0.54 μm, He |
Capillary | Supelcowax-10 | 60. | 1010. | Castello, Vezzani, et al., 1991 | N2; Column length: 60. m; Column diameter: 0.75 mm |
Packed | SP-1000 | 100. | 1010.7 | Castello and Gerbino, 1988 | He, Chromosorb W DMCS; Column length: 3. m |
Packed | SP-1000 | 125. | 1012.45 | Castello and Gerbino, 1988 | He, Chromosorb W DMCS; Column length: 3. m |
Packed | SP-1000 | 75. | 1007.14 | Castello and Gerbino, 1988 | He, Chromosorb W DMCS; Column length: 3. m |
Packed | Carbowax 20M | 75. | 999. | Goebel, 1982 | N2, Kieselgur (60-100 mesh); Column length: 2. m |

Kovats' RI, polar column, temperature ramp

Column type | Active phase | I | Reference | Comment |
---|---|---|---|---|
Capillary | CBP-20 | 993. | Shimadzu, 2003 | 25. m/0.2 mm/0.25 μm, He, 50. C @ 5. min, 4. K/min; Tend: 200. C |

Van Den Dool and Kratz RI, non-polar column, temperature ramp

Column type | Active phase | I | Reference | Comment |
---|---|---|---|---|
Capillary | SPB-5 | 703. | Engel and Ratel, 2007 | 60. m/0.32 mm/1. μm, 40. C @ 2. min, 3. K/min, 230. C @ 10. min |
Capillary | DB-5 | 702.1 | Xu, van Stee, et al., 2003 | 30. m/0.25 mm/1. μm, He, 2.5 K/min; Tstart: 50. C; Tend: 200. C |
Capillary | Petrocol DH | 683. | White, Hackett, et al., 1992 | 100. m/0.25 mm/0.5 μm, He, 1. K/min; Tstart: 30. C; Tend: 220. C |
Capillary | SE-54 | 702. | Weber, 1986 | 25. m/0.31 mm/0.17 μm, H2, 2. K/min; Tstart: 35. C |
Capillary | OV-1 | 687. | Schreyen, Dirinck, et al., 1976 | 1. K/min; Column length: 183. m; Column diameter: 0.762 mm; Tstart: 0. C; Tend: 230. C |

Normal alkane RI, non-polar column, isothermal

Column type | Active phase | Temperature (C) | I | Reference | Comment |
---|---|---|---|---|---|
Capillary | DB-1 | 60. | 691. | Shimadzu, 2003, 2 | 60. m/0.32 mm/1. μm, He |
Packed | DC-400 | 150. | 690. | Anderson, 1968 | Helium, Gas-Pak (60-80 mesh); Column length: 3.0 m |

Normal alkane RI, non-polar column, temperature ramp

Column type | Active phase | I | Reference | Comment |
---|---|---|---|---|
Capillary | HP-5 MS | 701. | Kotowska, Zalikowski, et al., 2012 | 30. m/0.25 mm/0.25 μm, Helium, 35. C @ 5. min, 3. K/min, 300. C @ 15. min |
Capillary | SPB-1 | 680. | Vichi, Castellote, et al., 2003 | 30. m/0.25 mm/0.25 μm, He, 40. C @ 10. min, 3. K/min; Tend: 200. C |
Capillary | SPB-1 | 680. | Vichi, Pizzale, et al., 2003 | 30. m/0.25 mm/0.25 μm, He, 40. C @ 10. min, 3. K/min; Tend: 200. C |
Capillary | BP-1 | 691. | Health Safety Executive, 2000 | 50. m/0.22 mm/0.75 μm, He, 5. K/min; Tstart: 50. C; Tend: 200. C |
Capillary | SE-54 | 722. | Huang, Liang, et al., 1996 | 36. m/0.25 mm/0.25 μm, 5. K/min; Tstart: 35. C; Tend: 240. C |
Capillary | DB-1 | 686. | Habu, Flath, et al., 1985 | 3. K/min; Column length: 50. m; Column diameter: 0.32 mm; Tstart: 0. C; Tend: 250. C |
Capillary | SF-96 | 690. | Donetzhuber, Johansson, et al., 1976 | Nitrogen, 3. K/min, 130. C @ 40. min; Column length: 111. m; Column diameter: 0.76 mm; Initial hold: 8. min |

Normal alkane RI, non-polar column, custom temperature program

Column type | Active phase | I | Reference | Comment |
---|---|---|---|---|
Capillary | HP-5 MS | 702. | Kotowska, Zalikowski, et al., 2012 | 30. m/0.25 mm/0.25 μm, Helium; Program: not specified |
Capillary | Methyl Silicone | 693. | Zenkevich, 2001 | Program: not specified |
Capillary | Methyl Silicone | 694. | Zenkevich, 2001 | Program: not specified |
Capillary | SPB-1 | 691. | Flanagan, Streete, et al., 1997 | 60. m/0.53 mm/5. μm, He; Program: 40C(6min) => 5C/min => 80C => 10C/min => 200C |
Capillary | DB-5 | 701. | Sorimachi, Tanabe, et al., 1995 | He; Column length: 30. m; Program: not specified |
Capillary | DB-1 | 681. | Ciccioli, Cecinato, et al., 1994 | 60. m/0.32 mm/0.25 μm; Program: not specified |
Capillary | DB-1 | 681. | Ciccioli, Brancaleoni, et al., 1993 | 60. m/0.32 mm/0.25 μm; Program: 3 min at 5 C; 5 - 50 C at 3 deg/min; 50 - 220 C at 5 deg/min |
Capillary | SPB-1 | 691. | Strete, Ruprah, et al., 1992 | 60. m/0.53 mm/5.0 μm, Helium; Program: 40 0C (6 min) 5 0C/min -> 80 0C 10 0C/min -> 200 0C |
Capillary | SPB-1 | 710. | Strete, Ruprah, et al., 1992 | 60. m/0.53 mm/5.0 μm, Helium; Program: not specified |
Capillary | CP Sil 8 CB | 700. | Weller and Wolf, 1989 | 40. m/0.25 mm/0.25 μm, He; Program: 30 0C (1 min) 15 0C/min -> 45 0C 3 0C/min -> 120 0C |
Capillary | methyl silicone oil with 5% Igepal | 686. | Schultz, Flath, et al., 1988 | Column length: 150. m; Column diameter: 0.75 mm; Program: not specified |
Capillary | methyl silicone oil with 5% Igepal | 689. | Schultz, Flath, et al., 1988 | Column length: 150. m; Column diameter: 0.75 mm; Program: not specified |
Capillary | DB-1 | 672. | Takeoka, Flath, et al., 1988 | 30. m/0.25 mm/0.25 μm, H2; Program: 30C (2min) => 2C/min => 150C => 4C/min => 250C |
Capillary | DB-1 | 686. | Takeoka, Flath, et al., 1988 | 30. m/0.25 mm/0.25 μm, H2; Program: 30C (2min) => 2C/min => 150C => 4C/min => 250C |
Capillary | OV-1, SE-30, Methyl silicone, SP-2100, OV-101, DB-1, etc. | 673. | Waggott and Davies, 1984 | Hydrogen; Column length: 50. m; Column diameter: 0.32 mm; Program: not specified |
Capillary | OV-1, SE-30, Methyl silicone, SP-2100, OV-101, DB-1, etc. | 680. | Waggott and Davies, 1984 | Hydrogen; Column length: 50. m; Column diameter: 0.32 mm; Program: not specified |
Capillary | OV-1, SE-30, Methyl silicone, SP-2100, OV-101, DB-1, etc. | 689. | Waggott and Davies, 1984 | Hydrogen; Column length: 50. m; Column diameter: 0.32 mm; Program: not specified |
Capillary | OV-1 | 710. | Ramsey and Flanagan, 1982 | Program: not specified |
Capillary | SE-30 | 683. | Heydanek and McGorrin, 1981 | He; Column length: 50. m; Column diameter: 0.5 mm; Program: -10C (8min) => 12C/min => 26C => 3C/min => 170C (30min) |

Normal alkane RI, polar column, isothermal

Column type | Active phase | Temperature (C) | I | Reference | Comment |
---|---|---|---|---|---|
Capillary | DB-Wax | 60. | 1010. | Shimadzu, 2003, 2 | 50. m/0.32 mm/1. μm, He |

Normal alkane RI, polar column, temperature ramp

Column type | Active phase | I | Reference | Comment |
---|---|---|---|---|
Capillary | DB-Wax | 1010. | Shimadzu, 2012 | 30. m/0.32 mm/0.50 μm, Helium, 4. K/min; Tstart: 40. C; Tend: 260. C |
Capillary | DB-Wax | 1010. | Shimadzu Corporation, 2003 | 30. m/0.32 mm/0.5 μm, He, 4. K/min; Tstart: 40. C; Tend: 260. C |
Capillary | Supelcowax-10 | 993. | Vichi, Castellote, et al., 2003 | 30. m/0.25 mm/0.25 μm, He, 40. C @ 10. min, 3. K/min; Tend: 200. C |
Capillary | Supelcowax-10 | 984. | Vichi, Pizzale, et al., 2003 | 30. m/0.25 mm/0.25 μm, He, 40. C @ 10. min, 3. K/min; Tend: 200. C |

Normal alkane RI, polar column, custom temperature program

Column type | Active phase | I | Reference | Comment |
---|---|---|---|---|
Capillary | Supelko CO Wax | 970. | Vekiari, Orepoulou, et al., 2010 | 60. m/0.32 mm/0.25 μm, Helium; Program: 40 0C (5 min) 4 0C/min -> 75 0C 5 0C/min -> 250 0C (10 min) |
Capillary | Supelcowax 10 | 993. | Soria, Martinez-Castro, et al., 2008 | 50. m/0.25 mm/0.25 μm, Helium; Program: 45 0C (15 min) 3 0C/min -> 75 0C 5 0C/min -> 180 0C (10 min) |
Capillary | Carbowax 400, Carbowax 20M, Carbowax 1540, Carbowax 4000, Superox 06, PEG 20M, etc. | 1028. | Waggott and Davies, 1984 | Hydrogen; Column length: 50. m; Column diameter: 0.32 mm; Program: not specified |
Capillary | Carbowax 400, Carbowax 20M, Carbowax 1540, Carbowax 4000, Superox 06, PEG 20M, etc. | 999. | Waggott and Davies, 1984 | Hydrogen; Column length: 50. m; Column diameter: 0.32 mm; Program: not specified |
Capillary | Superox 0.6; Carbowax 20M | 1028. | Waggott and Davies, 1984 | Hydrogen; Column length: 50. m; Column diameter: 0.32 mm; Program: not specified |
Capillary | Carbowax 20M | 964. | Ramsey and Flanagan, 1982 | Program: not specified |

Condensed phase thermochemistry data

Data compiled as indicated in comments:
DRB - Donald R. Burgess, Jr.
ALS - Hussein Y. Afeefy, Joel F. Liebman, and Stephen E. Stein
DH - Eugene S. Domalski and Elizabeth D. Hearing
Quantity | Value | Units | Method | Reference | Comment |
---|---|---|---|---|---|
ΔfH°liquid | -12.5 ± 0.7 | kcal/mol | Review | Manion, 2002 | weighted average of several measurements; DRB |
ΔfH°liquid | -12.7 ± 0.72 | kcal/mol | Ccr | Papina and Kolesov, 1985 | ALS |
ΔfH°liquid | -9.7 | kcal/mol | Cm | Kirkbride, 1956 | ALS |
Quantity | Value | Units | Method | Reference | Comment |
ΔcH°liquid | -226.5 ± 0.69 | kcal/mol | Ccr | Papina and Kolesov, 1985 | ALS |
ΔcH°liquid | -228.6 ± 2.0 | kcal/mol | Ccb | Smith, Bjellerup, et al., 1953 | Reanalyzed by Cox and Pilcher, 1970, Original value = -230. ± 2. kcal/mol; ALS |
Constant pressure heat capacity of liquid
Cp,liquid (cal/mol*K) | Temperature (K) | Reference | Comment |
---|---|---|---|
28.70 | 298. | Kurbatov, 1948 | T = 12 to 80°C, mean Cp, three temperatures.; DH |
29.80 | 298. | Trew and Watkins, 1933 | DH |

Phase change data

Data compiled as indicated in comments:
TRC - Thermodynamics Research Center, NIST Boulder Laboratories, Chris Muzny director
BS - Robert L. Brown and Stephen E. Stein
DRB - Donald R. Burgess, Jr.
ALS - Hussein Y. Afeefy, Joel F. Liebman, and Stephen E. Stein
AC - William E. Acree, Jr., James S. Chickos
DH - Eugene S. Domalski and Elizabeth D. Hearing
Quantity | Value | Units | Method | Reference | Comment |
---|---|---|---|---|---|
Tboil | 360.2 ± 0.3 | K | AVG | N/A | Average of 13 values; Individual data points |
Quantity | Value | Units | Method | Reference | Comment |
Tfus | 188.5 | K | N/A | Golovanova and Kolesov, 1984 | Uncertainty assigned by TRC = 0.2 K; TRC |
Tfus | 188.35 | K | N/A | Timmermans and Hennaut-Roland, 1955 | Uncertainty assigned by TRC = 0.3 K; TRC |
Quantity | Value | Units | Method | Reference | Comment |
Tc | 571. | K | N/A | Majer and Svoboda, 1985 | |
Quantity | Value | Units | Method | Reference | Comment |
ΔvapH° | 8.274 | kcal/mol | N/A | Majer and Svoboda, 1985 | |
ΔvapH° | 8.26 ± 0.02 | kcal/mol | Review | Manion, 2002 | employed 1980MMS calorimetry data plus a correction for non-ideality; DRB |
ΔvapH° | 8.119 ± 0.031 | kcal/mol | E | Papina and Kolesov, 1985 | ALS |
ΔvapH° | 8.25 ± 0.02 | kcal/mol | C | Majer, Sváb, et al., 1980 | AC |
ΔvapH° | 8.30 ± 0.10 | kcal/mol | V | Mathews, 1926 | Reanalyzed by Pedley, Naylor, et al., 1986, Original value = 7.52 ± 0.03 kcal/mol; ALS |
Enthalpy of vaporization
ΔvapH (kcal/mol) | Temperature (K) | Method | Reference | Comment |
---|---|---|---|---|
7.50 | 360.4 | N/A | Majer and Svoboda, 1985 | |
8.17 | 313. | N/A | Aucejo, Gonzalez-Alfaro, et al., 1995 | Based on data from 297. to 360. K.; AC |
8.27 | 295. | N/A | Stephenson and Malanowski, 1987 | Based on data from 280. to 428. K. See also Dykyj, 1970.; AC |
7.680 | 360.19 | V | McDonald, 1944 | ALS |
8.65 | 305. | N/A | McDonald, 1944 | Based on data from 290. to 359. K.; AC |
8.51 | 313. | N/A | Herz and Rathmann, 1912 | Based on data from 298. to 360. K. See also Boublik, Fried, et al., 1984.; AC |
Antoine Equation Parameters
log10(P) = A − (B / (T + C))
P = vapor pressure (atm)
T = temperature (K)
View plot Requires a JavaScript / HTML 5 canvas capable browser.
Temperature (K) | A | B | C | Reference | Comment |
---|---|---|---|---|---|
290.9 to 359.62 | 3.54775 | 974.538 | -85.811 | McDonald, 1944 | Coefficents calculated by NIST from author's data. |
Enthalpy of fusion
ΔfusH (kcal/mol) | Temperature (K) | Reference | Comment |
---|---|---|---|
2.020 | 188.5 | Golovanova and Kolesov, 1984, 2 | DH |
2.02 | 188.5 | Domalski and Hearing, 1996 | AC |
Entropy of fusion
ΔfusS (cal/mol*K) | Temperature (K) | Reference | Comment |
---|---|---|---|
10.7 | 188.5 | Golovanova and Kolesov, 1984, 2 | DH |

Gas phase ion energetics data

Data evaluated as indicated in comments:
L - Sharon G. Lias
Data compiled as indicated in comments:
LBLHLM - Sharon G. Lias, John E. Bartmess, Joel F. Liebman, John L. Holmes, Rhoda D. Levin, and W. Gary Mallard
LLK - Sharon G. Lias, Rhoda D. Levin, and Sherif A. Kafafi
RDSH - Henry M. Rosenstock, Keith Draxl, Bruce W. Steiner, and John T. Herron
B - John E. Bartmess
Quantity | Value | Units | Method | Reference | Comment |
---|---|---|---|---|---|
IE (evaluated) | 9.46 ± 0.02 | eV | N/A | N/A | L |
Electron affinity determinations
EA (eV) | Method | Reference | Comment |
---|---|---|---|
0.40 ± 0.22 | TDAs | Chen, Wiley, et al., 1994 | B |
0.29999 | ECD | Wiley, Chen, et al., 1991 | B |
Ionization energy determinations
IE (eV) | Method | Reference | Comment |
---|---|---|---|
9.68 | PE | Kimura, Katsumata, et al., 1981 | LLK |
9.48 | PE | Lake and Thompson, 1970 | RDSH |
9.45 ± 0.01 | PI | Watanabe, Nakayama, et al., 1962 | RDSH |
9.45 | PI | Bralsford, Harris, et al., 1960 | RDSH |
9.47 ± 0.01 | PI | Watanabe, 1957 | RDSH |
9.6 | PE | Von Niessen, Asbrink, et al., 1982 | Vertical value; LBLHLM |

References

Manion, 2002
Manion, J.A.,
Evaluated Enthalpies of Formation of the Stable Closed Shell C1 and C2 Chlorinated Hydrocarbons,
J. Phys. Chem. Ref. Data, 2002, 31, 1, 123-172, https://doi.org/10.1063/1.1420703
. [all data]
Papina and Kolesov, 1985
Papina, T.S.; Kolesov, V.P.,
Standard enthalpy of formation of trichloroethylene,
Russ. J. Phys. Chem. (Engl. Transl.), 1985, 59, 1289-1291. [all data]
Kirkbride, 1956
Kirkbride, F.W.,
The heats of chlorination of some hydrocarbons and their chloro-derivatives,
J. Appl. Chem., 1956, 6, 11-21. [all data]
Levanova, Bushneva, et al., 1979
Levanova, s.V.; Bushneva, I.I.; Rodova, R.M.; Rozhnov, A.M.; Treger, Yu.A.; Aprelkin, A.S.,
Thermodynamic stability of chloroethanes in dehydrochlorination reactions,
J. Appl. Chem. USSR, 1979, 52, 1439-1442. [all data]
Levanova, Bushneva, et al., 1976
Levanova, S.V.; Bushneva, L.I.; Rodova, R.M.; Rozhnov, A.M.; Treger, Yu.A.,
Liquid-phase dehydrochlorination of asymmetric tetrachloroethane,
Zh. Fiz. Khim., 1976, 50, 2701-2702. [all data]
Gossett, 1987
Gossett, J.M.,
Measurement of Henry's Law Constants for C1 and C2 Chlorinated Hydrocarbons,
Environ. Sci. Technol., 1987, 21, 202-208. [all data]
Leighton and Calo, 1981
Leighton, D.T.; Calo, J.M.,
Distribution Coefficients of Chlorinated Hydrocarbons in Dilute Air-Water Systems for Groundwater Contamination Applications,
J. Chem. Eng. Data, 1981, 26, 382-385. [all data]
Pearson and McConnell, 1975
Pearson, C.R.; McConnell, G.,
Chlorinated C1 and C2 Hydrocarbons in the Marine Environment,
Proc. R. Soc. London, B, 1975, 189, 305-332. [all data]
Annino and Villalobos, 1999
Annino, R.; Villalobos, R.,
A strategy for the simplification and solution of complex chromatographic analysis problems utilizing two-dimensional mapping of retention indexes followed by computer modeling of heart cuts from serially coupled columns containing different stationary phases,
J. Hi. Res. Chromatogr., 1999, 22, 10, 589-593. [all data]
Dewulf, Van Langenhove, et al., 1997
Dewulf, J.; Van Langenhove, H.; Everaert, M.,
Solid-phase microextraction of volatile organic compounds estimation of the sorption equilibrium from the Kováts index, effect of salinity and humic acids and the study of the kinetics by the development of an agitated/static layer model,
J. Chromatogr. A, 1997, 761, 1-2, 205-217, https://doi.org/10.1016/S0021-9673(96)00810-2
. [all data]
Villalobos, 1995
Villalobos, R.,
A window diagram for key component analysis in on-line gas chromatography,
J. Hi. Res. Chromatogr., 1995, 18, 6, 343-347, https://doi.org/10.1002/jhrc.1240180604
. [all data]
Castello, Vezzani, et al., 1991
Castello, G.; Vezzani, S.; Gerbino, T.,
Gas chromatographic separation and automatic identification of complex mixtures of organic solvents in indrustrial wates,
J. Chromatogr., 1991, 585, 2, 273-280, https://doi.org/10.1016/0021-9673(91)85088-W
. [all data]
Castello and Gerbino, 1988
Castello, G.; Gerbino, T.C.,
Effect of Temperature on the Gas Chromatographic Separation of Halogenated Compounds on Polar and Non-Polar Stationary Phases,
J. Chromatogr., 1988, 437, 33-45, https://doi.org/10.1016/S0021-9673(00)90369-8
. [all data]
Pacáková, Vojtechová, et al., 1988
Pacáková, V.; Vojtechová, H.; Coufal, P.,
Reaction gas chromatography: study of the photodecomposition of halogenated hydrocarbons,
Chromatographia, 1988, 25, 7, 621-626, https://doi.org/10.1007/BF02327659
. [all data]
Tiess, 1984
Tiess, D.,
Gaschromatographische Retentionsindices von 125 leicht- bis mittelflüchtigen organischen Substanzen toxikologisch-analytischer Relevanz auf SE-30,
Wiss. Z. Wilhelm-Pieck-Univ. Rostock Math. Naturwiss. Reihe, 1984, 33, 6-9. [all data]
Winskowski, 1983
Winskowski, J.,
Gaschromatographische Identifizierung von Stoffen anhand von Indexziffem und unterschiedlichen Detektoren,
Chromatographia, 1983, 17, 3, 160-165, https://doi.org/10.1007/BF02271041
. [all data]
Shimadzu, 2003
Shimadzu,
Gas chromatography analysis of organic solvents using capillary columns (No. 2), 2003, retrieved from http://www.shimadzu.com/apps/form.cfm. [all data]
Rembold, Wallner, et al., 1989
Rembold, H.; Wallner, P.; Nitz, S.; Kollmannsberger, H.; Drawert, F.,
Volatile components of chickpea (Cicer arietinum L.) seed,
J. Agric. Food Chem., 1989, 37, 3, 659-662, https://doi.org/10.1021/jf00087a018
. [all data]
Goebel, 1982
Goebel, K.-J.,
Gaschromatographische Identifizierung Niedrig Siedender Substanzen Mittels Retentionsindices und Rechnerhilfe,
J. Chromatogr., 1982, 235, 1, 119-127, https://doi.org/10.1016/S0021-9673(00)95793-5
. [all data]
Engel and Ratel, 2007
Engel, E.; Ratel, J.,
Correction of the data generated by mass spectrometry analyses of biological tissues: Application to food authentication,
J. Chromatogr. A, 2007, 1154, 1-2, 331-341, https://doi.org/10.1016/j.chroma.2007.02.012
. [all data]
Xu, van Stee, et al., 2003
Xu, X.; van Stee, L.L.P.; Williams, J.; Beens, J.; Adahchour, M.; Vreuls, R.J.J.; Brinkman, U.A.Th.; Lelieveld, J.,
Comprehensive two-dimensional gas chromatography (GC×GC) measurements of volatile organic compounds in the atmosphere,
Atmos. Chem. Phys., 2003, 3, 3, 665-682, https://doi.org/10.5194/acp-3-665-2003
. [all data]
White, Hackett, et al., 1992
White, C.M.; Hackett, J.; Anderson, R.R.; Kail, S.; Spock, P.S.,
Linear temperature programmed retention indices of gasoline range hydrocarbons and chlorinated hydrocarbons on cross-linked polydimethylsiloxane,
J. Hi. Res. Chromatogr., 1992, 15, 2, 105-120, https://doi.org/10.1002/jhrc.1240150211
. [all data]
Weber, 1986
Weber, L.,
Utilization of the Sadtler standard RI system in micropollution analyses,
J. Hi. Res. Chromatogr. Chromatogr. Comm., 1986, 9, 8, 446-451, https://doi.org/10.1002/jhrc.1240090806
. [all data]
Schreyen, Dirinck, et al., 1976
Schreyen, L.; Dirinck, P.; van Wassenhove, F.; Schamp, N.,
Analysis of leek volatiles by headspace condensation,
J. Agric. Food Chem., 1976, 24, 6, 1147-1152, https://doi.org/10.1021/jf60208a023
. [all data]
Shimadzu, 2003, 2
Shimadzu,
Gas chromatography analysis of organic solvents using capillary columns (No. 3), 2003, retrieved from http://www.shimadzu.com/apps/form.cfm. [all data]
Anderson, 1968
Anderson, D.G.,
USe of Kovats retention indices and response factors for the qualitative and quantitative analysis of coating solvents,
J. Paint Technol., 1968, 40, 527, 549-557. [all data]
Kotowska, Zalikowski, et al., 2012
Kotowska, U.; Zalikowski, M.; Isidorov, V.A.,
HS-SPME/GC-MS analysis of volatile and semi-volatile organic compounds emitted from municipal sewage sludge,
Environ. Monit. Asses., 2012, 184, 5, 2893-2907, https://doi.org/10.1007/s10661-011-2158-8
. [all data]
Vichi, Castellote, et al., 2003
Vichi, S.; Castellote, A.I.; Pizzale, L.; Conte, L.S.; Buxaderas, S.; López-Tamames, E.,
Analysis of virgin olive oil volatile compounds by headspace solid-phase microextraction coupled to gas chromatography with mass spectrometric and flame ionization detection,
J. Chromatogr. A, 2003, 983, 1-2, 19-33, https://doi.org/10.1016/S0021-9673(02)01691-6
. [all data]
Vichi, Pizzale, et al., 2003
Vichi, S.; Pizzale, L.; Conte, L.S.; Buxaderas, S.; López-Tamames, E.,
Solid-phase microextraction in the analysis of virgin olive oil volatile fraction: characterization of virgin olive oils from two distinct geographical areas of Northern Italy,
J. Agric. Food Chem., 2003, 51, 22, 6572-6577, https://doi.org/10.1021/jf030269c
. [all data]
Health Safety Executive, 2000
Health Safety Executive,
MDHS 96 Volatile organic compounds in air - Laboratory method using pumed solid sorbent tubes, solvent desorption and gas chromatography
in Methods for the Determination of Hazardous Substances (MDHS) guidance, Crown, Colegate, Norwich, 2000, 1-24, retrieved from http://www.hse.gov.uk/pubns/mdhs/pdfs/mdhs96.pdf. [all data]
Huang, Liang, et al., 1996
Huang, C.; Liang, H.; Han, S.,
The analysis of organic compounds in waste water by gas extraction/thermal desorption/gas chromatography-mass spectrometry,
Chin. J. Chromatogr., 1996, 14, 6, 421-424. [all data]
Habu, Flath, et al., 1985
Habu, T.; Flath, R.A.; Mon, T.R.; Morton, J.F.,
Volatile components of Rooibos tea (Aspalathus linearis),
J. Agric. Food Chem., 1985, 33, 2, 249-254, https://doi.org/10.1021/jf00062a024
. [all data]
Donetzhuber, Johansson, et al., 1976
Donetzhuber, A.; Johansson, K.; Sandstroem, C.,
Gas phase characterization of wood, pulp, and paper,
Appl. Polymer Symp., 1976, 28, 889-901. [all data]
Zenkevich, 2001
Zenkevich, I.G.,
Comparative Characterization of Conditions for Unambuguous Chromatographic Identification of Organic Compounds,
Zh. Anal. Khim., 2001, 56, 9, 915-924. [all data]
Flanagan, Streete, et al., 1997
Flanagan, R.J.; Streete, P.J.; Ramsey, J.D.,
Volatile Substance Abuse, UNODC Technical Series, No 5, United Nations, Office on Drugs and Crime, Vienna International Centre, PO Box 500, A-1400 Vienna, Austria, 1997, 56, retrieved from http://www.odccp.org/pdf/technicalseries1997-01-011.pdf. [all data]
Sorimachi, Tanabe, et al., 1995
Sorimachi, J.; Tanabe, A.; Mitobe, H.; Kuniaki, K.; Masaaki, S.,
Programmed temperature retention indices for volatile organic compounds on headspace GC/MS analysis,
Niigata-ken Eisei Kogai Kenkyusho Nenpo, 1995, 11, 75-79. [all data]
Ciccioli, Cecinato, et al., 1994
Ciccioli, P.; Cecinato, A.; Brancaleoni, E.; Brachetti, A.; Frattoni, M.; Sparapani, R.,
Composition and Distribution of Polar and Non-Polar VOCs in Urban, Rural, Forest and Remote Areas,
Eur Commission EUR, 1994, 549-568. [all data]
Ciccioli, Brancaleoni, et al., 1993
Ciccioli, P.; Brancaleoni, E.; Cecinato, A.; Sparapani, R.; Frattoni, M.,
Identification and determination of biogenic and anthropogenic volatile organic compounds in forest areas of Northern and Southern Europe and a remote site of the Himalaya region by high-resolution gas chromatography-mass spectrometry,
J. Chromatogr., 1993, 643, 1-2, 55-69, https://doi.org/10.1016/0021-9673(93)80541-F
. [all data]
Strete, Ruprah, et al., 1992
Strete, P.J.; Ruprah, M.; Ramsey, J.D.; Flanagan, R.J.,
Detection and identification of volatile substances by headspace capillary gas chromatography to aid the diagnosis of acute poisoning,
Analyst, 1992, 117, 7, 1111-1127, https://doi.org/10.1039/an9921701111
. [all data]
Weller and Wolf, 1989
Weller, J.-P.; Wolf, M.,
Massenspektroskopie und Headspace-GC,
Beitr. Gerichtl. Med., 1989, 47, 525-532. [all data]
Schultz, Flath, et al., 1988
Schultz, T.H.; Flath, R.A.; Stern, D.J.; Mon, T.R.; Teranishi, R.; McKenna Kruse, S.; Butlder, B.; Howard, W.E.,
Coyote estrous urine volatiles,
J. Chem. Ecol., 1988, 14, 2, 701-712, https://doi.org/10.1007/BF01013917
. [all data]
Takeoka, Flath, et al., 1988
Takeoka, G.R.; Flath, R.A.; Güntert, M.; Jennings, W.,
Nectarine volatiles: vacuum steam distillation versus headspace sampling,
J. Agric. Food Chem., 1988, 36, 3, 553-560, https://doi.org/10.1021/jf00081a037
. [all data]
Waggott and Davies, 1984
Waggott, A.; Davies, I.W.,
Identification of organic pollutants using linear temperature programmed retention indices (LTPRIs) - Part II, 1984, retrieved from http://dwi.defra.gov.uk/research/completed-research/reports/dwi0383.pdf. [all data]
Ramsey and Flanagan, 1982
Ramsey, J.D.; Flanagan, R.J.,
Detection and Identification of Volatile Organic Compounds in Blood by Headspace Gas Chromatography as an Aid to the Diagnosis of Solvent Abuse,
J. Chromatogr., 1982, 240, 2, 423-444, https://doi.org/10.1016/S0021-9673(00)99622-5
. [all data]
Heydanek and McGorrin, 1981
Heydanek, M.G.; McGorrin, R.J.,
Gas chromatography-mass spectroscopy investigations on the flavor chemistry of oat groats,
J. Agric. Food Chem., 1981, 29, 5, 950-954, https://doi.org/10.1021/jf00107a016
. [all data]
Shimadzu, 2012
Shimadzu, Pharmaceutical Related,
Analysis of pharmaceutical residual solvent (observation of separation) (1) - GC, 2012, retrieved from www.shimadzu.ru/applications/Applicationspdf/GC/Pharma/Pharmaceutical residual solvents GC.pdf. [all data]
Shimadzu Corporation, 2003
Shimadzu Corporation,
Analysis of pharmaceutical residual solvent (observation of separation), 2003, retrieved from http://www.shimadzu.com.br/analitica/aplicacoes/book/pharm69.pdf. [all data]
Vekiari, Orepoulou, et al., 2010
Vekiari, S.A.; Orepoulou, V.; Kourkoutas, Y.; Kamoun, N.; Msallem, M.; Psimouli, V.; Arapoglou, D.,
Characterization and seasonal variations of the quality of virgin olive oil of the Thoumbolia and Koroneiki varieties from Southern Greece,
Grasas y Aceites, 2010, 61, 3, 221-231, https://doi.org/10.3989/gya.108709
. [all data]
Soria, Martinez-Castro, et al., 2008
Soria, A.C.; Martinez-Castro, I.; Sanz, J.,
Some aspects of dynamic headspace analysis of volatile components in honey,
Foog Res. International, 2008, 41, 8, 838-848, https://doi.org/10.1016/j.foodres.2008.07.010
. [all data]