Acetyl hypofluorite

Phase change data

Data compiled by: William E. Acree, Jr., James S. Chickos

Enthalpy of vaporization

ΔvapH (kJ/mol) Temperature (K) Reference Comment
35.6 ± 2.4231.Appelman, Mendelsohn, et al., 1985Based on data from 209. - 253. K.

References

Appelman, Mendelsohn, et al., 1985
Appelman, Evan H.; Mendelsohn, Marshall H.; Kim, Hyunyong, Isolation and characterization of acetyl hypofluorite, J. Am. Chem. Soc., 1985, 107, 23, 6515-6518, https://doi.org/10.1021/ja00309a016 . [all data]