o,p'-DDT
- Formula: C14H9Cl5
- Molecular weight: 354.486
- IUPAC Standard InChIKey: CVUGPAFCQJIYDT-UHFFFAOYSA-N
- CAS Registry Number: 789-02-6
- Chemical structure:
View 3d structure (requires JavaScript / HTML 5) - Other names: Benzene, 1-chloro-2-[2,2,2-trichloro-1-(4-chlorophenyl)ethyl]-; Ethane, 1,1,1-trichloro-2-(o-chlorophenyl)-2-(p-chlorophenyl)-; 2-(2-Chlorophenyl)-2-(4-chlorophenyl)-1,1,1-trichloroethane; 2,4'-DDT; 1-(o-Chlorophenyl)-1-(p-chlorophenyl)-2,2,2-trichloro ethane; Ethane, 2-(o-chlorophenyl)-2-(p-chlorophenyl)-1,1,1-trichloro-; 1,1,1-Trichloro-2-(o-chlorophenyl)-2-(p-chlorophenyl)ethane; 2,2-Bis(o,p-chlorophenyl)-1,1,1-trichloroethane; o,p-DDT; DDT-o,p'; 1,1,1-Trichloro-2-(2-chlorophenyl)-2-(4-chlorophenyl)ethane; (.+/-.)-1-(o-Chlorophenyl)-1-(p-chlorophenyl)-2,2,2-trichloroethane; NSC 33446; NSC 57644; 1-Chloro-2-[2,2,2-trichloro-1-(4-chlorophenyl)ethyl]benzene; 2,2,2,o,p'-pentachloroethylidenebisbenzene; 1,1,1-Trichloro-2-(4-chlorophenyl)-2-(2-chlorophenyl)ethane (p,o'-DDT)

Phase change data

Data compiled as indicated in comments:
TRC - Thermodynamics Research Center, NIST Boulder Laboratories, Chris Muzny director
AC - William E. Acree, Jr., James S. Chickos
Quantity | Value | Units | Method | Reference | Comment |
---|---|---|---|---|---|
Tfus | 346.97 | K | N/A | Donnelly, Drewes, et al., 1990 | Uncertainty assigned by TRC = 0.2 K; TRC |
Tfus | 349.0 | K | N/A | Plato and Glasgow, 1969 | Uncertainty assigned by TRC = 0.2 K; TRC |
Enthalpy of vaporization
ΔvapH (kJ/mol) | Temperature (K) | Method | Reference | Comment |
---|---|---|---|---|
88.6 | 398. | GC | Hinckley, Bidleman, et al., 1990 | Based on data from 343. to 453. K.; AC |
Enthalpy of fusion
ΔfusH (kJ/mol) | Temperature (K) | Method | Reference | Comment |
---|---|---|---|---|
23.09 | 345.8 | DSC | Donnelly, Drewes, et al., 1990, 2 | AC |

Normal alkane RI, polar column, custom temperature program

Data compiled by: NIST Mass Spectrometry Data Center, William E. Wallace, director

Column type Capillary
Active phase Carbowax 20M
Column length (m)
Carrier gas
Substrate
Column diameter (mm)
Phase thickness (μm)
Program not specified
I 3127.
ReferenceTameo and Kiyos, 1991
Comment MSDC-RI

References

Donnelly, Drewes, et al., 1990
Donnelly, J.R.; Drewes, L.A.; Johnson, R.L.; Munslow, W.D.; Knapp, K.K.; Sovocool, G.W.,
Purity and heat of fusion data for environmental standards as determined by differential scanning calorimetry,
Thermochim. Acta, 1990, 167, 2, 155, https://doi.org/10.1016/0040-6031(90)80476-F
. [all data]
Plato and Glasgow, 1969
Plato, C.; Glasgow, A.R., Jr.,
Differential scanning calorimetry as a general method for determining the purity and heat of fusion of high-purity organic chemicals. Application to 95 compounds,
Anal. Chem., 1969, 41, 2, 330, https://doi.org/10.1021/ac60271a041
. [all data]
Hinckley, Bidleman, et al., 1990
Hinckley, Daniel A.; Bidleman, Terry F.; Foreman, William T.; Tuschall, Jack R.,
Determination of vapor pressures for nonpolar and semipolar organic compounds from gas chromatograhic retention data,
J. Chem. Eng. Data, 1990, 35, 3, 232-237, https://doi.org/10.1021/je00061a003
. [all data]
Donnelly, Drewes, et al., 1990, 2
Donnelly, J.R.; Drewes, L.A.; Johnson, R.L.; Munslow, W.D.; Knapp, K.K.; Sovocool, G.W.,
Purity and heat of fusion data for environmental standards as determined by differential scanning calorimetry,
Thermochimica Acta, 1990, 167, 2, 155-187, https://doi.org/10.1016/0040-6031(90)80476-F
. [all data]