Carbazole, 2,3,5-trimethyl-
- Formula: C15H15N
- Molecular weight: 209.2863
- IUPAC Standard InChIKey: XRASCGVLJXKEHA-UHFFFAOYSA-N
- CAS Registry Number: 78787-85-6
- Chemical structure:
View 3d structure (requires JavaScript / HTML 5) - Other names: 2,3,5-Trimethylcarbazole

Normal alkane RI, non-polar column, temperature ramp

Column type | Active phase | I | Reference | Comment |
---|---|---|---|---|
Capillary | DB-Petro | 2178. | Lu, Wu, et al., 2004 | 50. m/0.20 mm/0.50 μm, He, 35. C @ 5. min, 2. K/min, 300. C @ 5. min |

References

Lu, Wu, et al., 2004
Lu, X.; Wu, J.; Wu, J.; Kong, H.; Hua, R.; Tao, W.; Gu, J.; Xu, G.,
Characterization and quantitative determination of diesel fractions by comprehensive two-dimensional gas chromatography/time of flight mass spectrometry,
Chin. J. Chromatogr., 2004, 22, 1, 5-11. [all data]