Carbazole, 2,6-dimethyl-
- Formula: C14H13N
- Molecular weight: 195.2597
- IUPAC Standard InChIKey: JEQGMFVANDIHGJ-UHFFFAOYSA-N
- CAS Registry Number: 78787-80-1
- Chemical structure:

Phase change data

Data compiled by: Thermodynamics Research Center, NIST Boulder Laboratories, Chris Muzny director
Quantity | Value | Units | Method | Reference | Comment |
---|---|---|---|---|---|
Tfus | 481.65 | K | N/A | Borsche, 1908 | Uncertainty assigned by TRC = 2. K |

Normal alkane RI, non-polar column, temperature ramp

View large format table.

Column type Active phase I Reference Comment
CapillaryPONA1920.Yang, Wang, et al., 200450. m/0.20 mm/0.50 μm, 1.5 K/min, 270. C @ 10. min; Tstart: 120. C

References

Borsche, 1908
Borsche, W.,
On tetra- & hexahydrocarbazole compounds and a new carbazole synthesis.,
Justus Liebigs Ann. Chem., 1908, 359, 49. [all data]