Flumazenil
- Formula: C15H14FN3O3
- Molecular weight: 303.2884
- IUPAC Standard InChIKey: OFBIFZUFASYYRE-UHFFFAOYSA-N
- CAS Registry Number: 78755-81-4
- Chemical structure:
View 3d structure (requires JavaScript / HTML 5) - Other names: 4H-Imidazo(1,5-a)(1,4)benzodiazepine-3-carboxylic acid, 8-fluoro-5,6-dihydro-5-methyl-6-oxo-, ethyl ester; Anexate; Flumazepil; Ro-15-1788; Ethyl 8-fluoro-5,6-dihydro-5-methyl-6-oxo-4H-imidazo[1,5-a][1,4]benzodiazepine-3-carboxylate; Ethyl 8-fluoro-5,6-dihydro-5-methyl-6-oxo-4H-imidazo[1,5-a][1,4]benzodiazepin-3-carboxylate; Lanexat; Mazicon; Ro-15-1788/000; Romazicon; Ro 151788; flumazenil (Ro-15-1788)

Kovats' RI, non-polar column, custom temperature program

Column type | Active phase | I | Reference | Comment |
---|---|---|---|---|
Capillary | OV-1 | 2560. | Schütz, 1988 | Program: not specified |

References

Schütz, 1988
Schütz, H.,
Modern screening strategies in analytical toxicology with special regard to new benzodiazepines,
Z. Rechtsmed., 1988, 100, 1, 19-37, https://doi.org/10.1007/BF00200362
. [all data]