Oxetane, 3,3-bis-(chloromethyl)
- Formula: C5H8Cl2O
- Molecular weight: 155.022
- IUPAC Standard InChIKey: CXURGFRDGROIKG-UHFFFAOYSA-N
- CAS Registry Number: 78-71-7
- Chemical structure:

Gas phase thermochemistry data

Data compiled by: Hussein Y. Afeefy, Joel F. Liebman, and Stephen E. Stein
Quantity | Value | Units | Method | Reference | Comment |
---|---|---|---|---|---|
ΔfH°gas | -204.0 ± 1.9 | kJ/mol | Ccr | Ringner, Sunner, et al., 1971 |

Condensed phase thermochemistry data

Data compiled as indicated in comments:
ALS - Hussein Y. Afeefy, Joel F. Liebman, and Stephen E. Stein
DH - Eugene S. Domalski and Elizabeth D. Hearing
Quantity | Value | Units | Method | Reference | Comment |
---|---|---|---|---|---|
ΔfH°liquid | -260.0 ± 1.8 | kJ/mol | Ccr | Ringner, Sunner, et al., 1971 | ALS |
Quantity | Value | Units | Method | Reference | Comment |
ΔcH°liquid | -2898.3 ± 1.8 | kJ/mol | Ccr | Ringner, Sunner, et al., 1971 | ALS |
Quantity | Value | Units | Method | Reference | Comment |
S°liquid | 274.4 | J/mol*K | N/A | Dainton, Evans, et al., 1962 | DH |
Constant pressure heat capacity of liquid
Cp,liquid (J/mol*K) | Temperature (K) | Reference | Comment |
---|---|---|---|
218.7 | 300. | Dainton, Evans, et al., 1962 | T = 20 to 310 K.; DH |

Phase change data

Data compiled as indicated in comments:
TRC - Thermodynamics Research Center, NIST Boulder Laboratories, Chris Muzny director
ALS - Hussein Y. Afeefy, Joel F. Liebman, and Stephen E. Stein
AC - William E. Acree, Jr., James S. Chickos
DH - Eugene S. Domalski and Elizabeth D. Hearing

Quantity Value Units Method Reference Comment
Ttriple292.16KN/ADainton, Evans, et al., 1962Crystal phase 1 phase; Uncertainty assigned by TRC = 0.02 K; TRC
Quantity Value Units Method Reference Comment
Δvap13.38kcal/molN/AMajer and Svoboda, 1985
Δvap13.38 ± 0.091kcal/molCRingner, Sunner, et al., 1971ALS
Δvap13.4 ± 0.1kcal/molCRingner, Sunner, et al., 1971AC

Enthalpy of fusion

ΔfusH (kcal/mol) Temperature (K) Reference Comment
4.051292.2Domalski and Hearing, 1996AC

Enthalpy of phase transition

ΔHtrs (kcal/mol) Temperature (K) Initial Phase Final Phase Reference Comment
4.0497292.16crystaline, IliquidDainton, Evans, et al., 1962, 2Premelting occurs above 250 K.; DH

Entropy of phase transition

ΔStrs (cal/mol*K) Temperature (K) Initial Phase Final Phase Reference Comment
13.86292.16crystaline, IliquidDainton, Evans, et al., 1962, 2Premelting; DH

In addition to the Thermodynamics Research Center (TRC) data available from this site, much more physical and chemical property data is available from the following TRC products:

References

Ringner, Sunner, et al., 1971
Ringner, B.; Sunner, S.; Watanabe, H.,
The enthalpies of combustion and formation of some 3,3-disubstituted oxetanes,
Acta Chem. Scand., 1971, 25, 141-146. [all data]
Dainton, Evans, et al., 1962
Dainton, F.S.; Evans, D.M.; Hoare, F.E.; Melia, T.P.,
Thermodynamic functions of linear high polymers. Part II. Thermodynamic functions of penton,
Polymer, 1962, 3, 271-276. [all data]